﻿"Dublin Core:Title","Dublin Core:Description","Dublin Core:Date","Dublin Core:Creator","Dublin Core:Source","Dublin Core:Identifier","Dublin Core:Contributor","Dublin Core:Rights","Dublin Core:Relation","Dublin Core:Format","Dublin Core:Language","Dublin Core:Type","Dublin Core:Coverage","Dublin Core:Subject","Dublin Core:Publisher","Item Type Metadata:Birth Date","Item Type Metadata:Birthplace","Item Type Metadata:Event Type","Item Type Metadata:Participants","Item Type Metadata:URL","Item Type Metadata:Death Date","Item Type Metadata:Occupation","Item Type Metadata:Biographical Text","Item Type Metadata:Bibliography","Item Type Metadata:File name","Item Type Metadata:Time Summary","Item Type Metadata:Interviewer","Item Type Metadata:Interviewee","Item Type Metadata:Location","Item Type Metadata:Transcription","Item Type Metadata:Local URL","Item Type Metadata:Original Format","Item Type Metadata:Physical Dimensions","Item Type Metadata:Duration","Item Type Metadata:Compression","Item Type Metadata:Producer","Item Type Metadata:Director","Item Type Metadata:Bit Rate/Frequency","Item Type Metadata:Text","Item Type Metadata:Email Body","Item Type Metadata:Subject Line","Item Type Metadata:From","Item Type Metadata:To","Item Type Metadata:CC","Item Type Metadata:BCC","Item Type Metadata:Number of Attachments","Item Type Metadata:Standards","Item Type Metadata:Objectives","Item Type Metadata:Materials","Item Type Metadata:Tags",tags,file,itemType,collection,public,featured
"<strong>LUNGREN</strong>, Fernand",<em>Pyramids</em>,1901,"<strong>LUNGREN</strong>, Fernand","Fernand Lungren Bequest",1964.747,,,,,,,,,,,,,,,,,,,,,,,,,,,,,,,,,,,,,,,,,,,,,"19th century,20th century,Desert,landscape,oil,Painting,pyramids",http://art-collections.museum.ucsb.edu/files/original/a5f6a5adb1e509dd535cb0c528fefe33.jpg,"Physical Object","<strong>The Fernand Lungren Bequest</strong>",1,0
"<strong>LUNGREN</strong>, Fernand","<em>End of Inyo Range (unfinished)</em>",n.d.,"<strong>LUNGREN</strong>, Fernand","Fernand Lungren Bequest",1964.746,,,,,,,,,,,,,,,,,,,,,,,,,,,,,,,,,,,,,,,,,,,,,,,"Physical Object","<strong>The Fernand Lungren Bequest</strong>",1,0
"<strong>LUNGREN</strong>, Fernand","<em>The War Party No. 2</em>",n.d.,"<strong>LUNGREN</strong>, Fernand","Fernand Lungren Bequest",1964.745,,,,,,,,,,,,,,,,,,,,,,,,,,,,,,,,,,,,,,,,,,,,,,,"Physical Object","<strong>The Fernand Lungren Bequest</strong>",1,0
"<strong>LUNGREN</strong>, Fernand","<em>The War Party No. 1</em>",n.d.,"<strong>LUNGREN</strong>, Fernand","Fernand Lungren Bequest",1964.744,,,,,,,,,,,,,,,,,,,,,,,,,,,,,,,,,,,,,,,,,,,,,,,"Physical Object","<strong>The Fernand Lungren Bequest</strong>",1,0
"<strong>LUNGREN</strong>, Fernand","<em>The Yellow Buttes</em>",n.d.,"<strong>LUNGREN</strong>, Fernand","Fernand Lungren Bequest",1964.743,,,,,,,,,,,,,,,,,,,,,,,,,,,,,,,,,,,,,,,,,,,,,,,"Physical Object","<strong>The Fernand Lungren Bequest</strong>",1,0
"<strong>LUNGREN</strong>, Fernand","<em>The Pueblo</em>",n.d.,"<strong>LUNGREN</strong>, Fernand","Fernand Lungren Bequest",1964.742,,,,,,,,,,,,,,,,,,,,,,,,,,,,,,,,,,,,,,,,,,,,,,,"Physical Object","<strong>The Fernand Lungren Bequest</strong>",1,0
"<strong>LUNGREN</strong>, Fernand","<em>Line of Cattle</em>","19th-20th C","<strong>LUNGREN</strong>, Fernand","Fernand Lungren Bequest",1964.741,,,,,,,,,,,,,,,,,,,,,,,,,,,,,,,,,,,,,,,,,,,,,,,"Physical Object","<strong>The Fernand Lungren Bequest</strong>",1,0
"<strong>LUNGREN</strong>, Fernand","<em>""Lay in"" for Cab Picture</em>",n.d.,"<strong>LUNGREN</strong>, Fernand","Fernand Lungren Bequest",1964.740,,,,,,,,,,,,,,,,,,,,,,,,,,,,,,,,,,,,,,,,,,,,,,,"Physical Object","<strong>The Fernand Lungren Bequest</strong>",1,0
"<strong>LUNGREN</strong>, Fernand","<em>A Gray Day: London</em>",n.d.,"<strong>LUNGREN</strong>, Fernand","Fernand Lungren Bequest",1964.739,,,,,,,,,,,,,,,,,,,,,,,,,,,,,,,,,,,,,,,,,,,,,"19th century,20th century,canvas,Fog,landscape,oil,Painting",http://art-collections.museum.ucsb.edu/files/original/39b4043b5d340c883bc47dfe6f7a7a9a.jpg,"Physical Object","<strong>The Fernand Lungren Bequest</strong>",1,0
"<strong>LUNGREN</strong>, Fernand","<em>Cowboy: Mounted</em>",n.d.,"<strong>LUNGREN</strong>, Fernand","Fernand Lungren Bequest",1964.738,,,,,,,,,,,,,,,,,,,,,,,,,,,,,,,,,,,,,,,,,,,,,,,"Physical Object","<strong>The Fernand Lungren Bequest</strong>",1,0
"<strong>LUNGREN</strong>, Fernand",<em>Branding</em>,n.d.,"<strong>LUNGREN</strong>, Fernand","Fernand Lungren Bequest",1964.737,,,,,,,,,,,,,,,,,,,,,,,,,,,,,,,,,,,,,,,,,,,,,,,"Physical Object","<strong>The Fernand Lungren Bequest</strong>",1,0
"<strong>LUNGREN</strong>, Fernand","<em>Lungren Home</em>",n.d.,"<strong>LUNGREN</strong>, Fernand","Fernand Lungren Bequest",1964.736,,,,,,,,,,,,,,,,,,,,,,,,,,,,,,,,,,,,,,,,,,,,,"19th century,20th century,landscape,mountains,oil,Painting,trees",http://art-collections.museum.ucsb.edu/files/original/7e37f3ed3d79f5c20d30aedb4634bd25.jpg,"Physical Object","<strong>The Fernand Lungren Bequest</strong>",1,0
"<strong>LUNGREN</strong>, Fernand","<em>Poplars and Cotton Woods</em>",n.d.,"<strong>LUNGREN</strong>, Fernand","Fernand Lungren Bequest",1964.735,,,,,,,,,,,,,,,,,,,,,,,,,,,,,,,,,,,,,,,,,,,,,,,"Physical Object","<strong>The Fernand Lungren Bequest</strong>",1,0
"<strong>LUNGREN</strong>, Fernand","<em>Canyon Study</em>",n.d.,"<strong>LUNGREN</strong>, Fernand","Fernand Lungren Bequest",1964.734,,,,,,,,,,,,,,,,,,,,,,,,,,,,,,,,,,,,,,,,,,,,,,,"Physical Object","<strong>The Fernand Lungren Bequest</strong>",1,0
"<strong>LUNGREN</strong>, Fernand","<em>High Priest of the Sab Wimpkia</em>",n.d.,"<strong>LUNGREN</strong>, Fernand","Fernand Lungren Bequest",1964.733,,,,,,,,,,,,,,,,,,,,,,,,,,,,,,,,,,,,,,,,,,,,,,,"Physical Object","<strong>The Fernand Lungren Bequest</strong>",1,0
"<strong>LUNGREN</strong>, Fernand","<em>Saving His Scalp</em>",n.d.,"<strong>LUNGREN</strong>, Fernand","Fernand Lungren Bequest",1964.732,,,,,,,,,,,,,,,,,,,,,,,,,,,,,,,,,,,,,,,,,,,,,,,"Physical Object","<strong>The Fernand Lungren Bequest</strong>",1,0
"<strong>LUNGREN</strong>, Fernand","<em>Study of Rincon</em>",n.d.,"<strong>LUNGREN</strong>, Fernand","Fernand Lungren Bequest",1964.731,,,,,,,,,,,,,,,,,,,,,,,,,,,,,,,,,,,,,,,,,,,,,"19th century,20th century,landscape,Mountain,oil,Painting,seascape",http://art-collections.museum.ucsb.edu/files/original/38e7097ce79e61ebf106ac759d4466dd.jpg,"Physical Object","<strong>The Fernand Lungren Bequest</strong>",1,0
"<strong>LUNGREN</strong>, Fernand","<em>Shadows on the Cliffs</em>",n.d.,"<strong>LUNGREN</strong>, Fernand","Fernand Lungren Bequest",1964.730,,,,,,,,,,,,,,,,,,,,,,,,,,,,,,,,,,,,,,,,,,,,,,,"Physical Object","<strong>The Fernand Lungren Bequest</strong>",1,0
"<strong>LUNGREN</strong>, Fernand","<em>Lungren Home--Mission Canyon</em>",n.d.,"<strong>LUNGREN</strong>, Fernand","Fernand Lungren Bequest",1964.729,,,,,,,,,,,,,,,,,,,,,,,,,,,,,,,,,,,,,,,,,,,,,,,"Physical Object","<strong>The Fernand Lungren Bequest</strong>",1,0
"<strong>LUNGREN</strong>, Fernand","<em>Panel: Red Rock Canyon</em>","19th-20th C","<strong>LUNGREN</strong>, Fernand","Fernand Lungren Bequest",1964.728,,,,,,,,,,,,,,,,,,,,,,,,,,,,,,,,,,,,,,,,,,,,,,,"Physical Object","<strong>The Fernand Lungren Bequest</strong>",1,0
"<strong>LUNGREN</strong>, Fernand","<em>Looking into Grand Can</em>yon",n.d.,"<strong>LUNGREN</strong>, Fernand","Fernand Lungren Bequest",1964.727,,,,,,,,,,,,,,,,,,,,,,,,,,,,,,,,,,,,,,,,,,,,,,,"Physical Object","<strong>The Fernand Lungren Bequest</strong>",1,0
"<strong>LUNGREN</strong>, Fernand","<em>Water Carrier</em>",n.d.,"<strong>LUNGREN</strong>, Fernand","Fernand Lungren Bequest",1964.726,,,,,,,,,,,,,,,,,,,,,,,,,,,,,,,,,,,,,,,,,,,,,,,"Physical Object","<strong>The Fernand Lungren Bequest</strong>",1,0
"<strong>LUNGREN</strong>, Fernand","<em>Mojave Butte</em>",n.d.,"<strong>LUNGREN</strong>, Fernand","Fernand Lungren Bequest",1964.725,,,,,,,,,,,,,,,,,,,,,,,,,,,,,,,,,,,,,,,,,,,,,,,"Physical Object","<strong>The Fernand Lungren Bequest</strong>",1,0
"<strong>LUNGREN</strong>, Fernand","<em>Navajo Weaver</em>",n.d.,"<strong>LUNGREN</strong>, Fernand","Fernand Lungren Bequest",1964.724,,,,,,,,,,,,,,,,,,,,,,,,,,,,,,,,,,,,,,,,,,,,,,,"Physical Object","<strong>The Fernand Lungren Bequest</strong>",1,0
"<strong>LUNGREN</strong>, Fernand","<em>Canyon de Chelly</em>","ca. 1903-06","<strong>LUNGREN</strong>, Fernand","Fernand Lungren Bequest",1964.723,,,,,,,,,,,,,,,,,,,,,,,,,,,,,,,,,,,,,,,,,,,,,"19th century,20th century,canvas,canyon,landscape,oil,Painting",http://art-collections.museum.ucsb.edu/files/original/be664133f37addf44d0fd666066a552e.jpg,"Physical Object","<strong>The Fernand Lungren Bequest</strong>",1,0
"<strong>LUNGREN</strong>, Fernand","<em>An Overlook</em>",n.d.,"<strong>LUNGREN</strong>, Fernand","Fernand Lungren Bequest",1964.722,,,,,,,,,,,,,,,,,,,,,,,,,,,,,,,,,,,,,,,,,,,,,"19th century,20th century,canvas,Flowers,landscape,oil,Painting",http://art-collections.museum.ucsb.edu/files/original/823c3949fc2059e3c998970fa85c4726.jpg,"Physical Object","<strong>The Fernand Lungren Bequest</strong>",1,0
"<strong>LUNGREN</strong>, Fernand","<em>Red Cliffs</em>",n.d.,"<strong>LUNGREN</strong>, Fernand","Fernand Lungren Bequest",1964.721,,,,,,,,,,,,,,,,,,,,,,,,,,,,,,,,,,,,,,,,,,,,,,,"Physical Object","<strong>The Fernand Lungren Bequest</strong>",1,0
"<strong>LUNGREN</strong>, Fernand","<em>Study: Cotton Woods</em>",n.d.,"<strong>LUNGREN</strong>, Fernand","Fernand Lungren Bequest",1964.72,,,,,,,,,,,,,,,,,,,,,,,,,,,,,,,,,,,,,,,,,,,,,,,"Physical Object","<strong>The Fernand Lungren Bequest</strong>",1,0
"<strong>LUNGREN</strong>, Fernand","<em>Study for Attack</em>",n.d.,"<strong>LUNGREN</strong>, Fernand","Fernand Lungren Bequest",1964.719,,,,,,,,,,,,,,,,,,,,,,,,,,,,,,,,,,,,,,,,,,,,,,,"Physical Object","<strong>The Fernand Lungren Bequest</strong>",1,0
"<strong>LUNGREN</strong>, Fernand","<em>The Attack</em>",n.d.,"<strong>LUNGREN,</strong> Fernand","Fernand Lungren Bequest",1964.718,,,,,,,,,,,,,,,,,,,,,,,,,,,,,,,,,,,,,,,,,,,,,,,"Physical Object","<strong>The Fernand Lungren Bequest</strong>",1,0
"<strong>LUNGREN</strong>, Fernand","<em>The Freighter</em>",n.d.,"<strong>LUNGREN</strong>, Fernand","Fernand Lungren Bequest",1964.717,,,,,,,,,,,,,,,,,,,,,,,,,,,,,,,,,,,,,,,,,,,,,"19th century,20th century,Boat,canvas,oil,Painting,seascape,Yellow",http://art-collections.museum.ucsb.edu/files/original/723b9748213bb58f2de7ea918b5da861.jpg,"Physical Object","<strong>The Fernand Lungren Bequest</strong>",1,0
"<strong>LUNGREN</strong>, Fernand","<em>Study: Canyon de Chelly</em>",n.d.,"<strong>LUNGREN</strong>, Fernand","Fernand Lungren Bequest",1964.716,,,,,,,,,,,,,,,,,,,,,,,,,,,,,,,,,,,,,,,,,,,,,,,"Physical Object","<strong>The Fernand Lungren Bequest</strong>",1,0
"<strong>LUNGREN</strong>, Fernand","<em>Cotton Wood Meadow</em>",n.d.,"<strong>LUNGREN</strong>, Fernand","Fernand Lungren Bequest",1964.715,,,,,,,,,,,,,,,,,,,,,,,,,,,,,,,,,,,,,,,,,,,,,,,"Physical Object","<strong>The Fernand Lungren Bequest</strong>",1,0
"<strong>LUNGREN</strong>, Fernand","<em>White Canyon</em>",n.d.,"<strong>LUNGREN</strong>, Fernand","Fernand Lungren Bequest",1964.714,,,,,,,,,,,,,,,,,,,,,,,,,,,,,,,,,,,,,,,,,,,,,,,"Physical Object","<strong>The Fernand Lungren Bequest</strong>",1,0
"<strong>LUNGREN</strong>, Fernand","<em>Silent Sea</em>","ca. 1926-30","<strong>LUNGREN</strong>, Fernand","Fernand Lungren Bequest",1964.713,,,,,,,,,,,,,,,,,,,,,,,,,,,,,,,,,,,,,,,,,,,,,"19th century,20th century,canvas,oil,Painting,seascape,water",http://art-collections.museum.ucsb.edu/files/original/27e0e9a4fab4549234a9e52c671b26e5.jpg,"Physical Object","<strong>The Fernand Lungren Bequest</strong>",1,0
"<strong>LUNGREN</strong>, Fernand","<em>Road to the Corral</em>",1903-10,"<strong>LUNGREN</strong>, Fernand","Fernand Lungren Bequest",1964.712,,,,,,,,,,,,,,,,,,,,,,,,,,,,,,,,,,,,,,,,,,,,,"19th century,20th century,canvas,landscape,oil,Painting,trees,Yellow",http://art-collections.museum.ucsb.edu/files/original/4159daa1eb7848b219a02c6ab19ec345.jpg,"Physical Object","<strong>The Fernand Lungren Bequest</strong>",1,0
"<strong>LUNGREN</strong>, Fernand","<em>Indian Boys Playing</em>",n.d.,"<strong>LUNGREN,</strong> Fernand","Fernand Lungren Bequest",1964.711,,,,,,,,,,,,,,,,,,,,,,,,,,,,,,,,,,,,,,,,,,,,,"19th century,20th century,canvas,canyon,landscape,Native American,oil,Painting",http://art-collections.museum.ucsb.edu/files/original/cdd2532cb9756e0e6f59c2360afff915.jpg,"Physical Object","<strong>The Fernand Lungren Bequest</strong>",1,0
"<strong>LUNGREN</strong>, Fernand","<em>The Pink Cloud No. 2</em>",n.d.,"<strong>LUNGREN</strong>, Fernand","Fernand Lungren Bequest",1964.710,,,,,,,,,,,,,,,,,,,,,,,,,,,,,,,,,,,,,,,,,,,,,"19th century,20th century,canvas,landscape,oil,Painting,Yellow",http://art-collections.museum.ucsb.edu/files/original/079d93ddba7051686410fea6f0fba8cd.jpg,"Physical Object","<strong>The Fernand Lungren Bequest</strong>",1,0
"<strong>LUNGREN</strong>, Fernand","<em>Red Mesa</em>",n.d.,"<strong>LUNGREN</strong>, Fernand","Fernand Lungren Bequest",1964.709,,,,,,,,,,,,,,,,,,,,,,,,,,,,,,,,,,,,,,,,,,,,,,,"Physical Object","<strong>The Fernand Lungren Bequest</strong>",1,0
"<strong>LUNGREN</strong>, Fernand","<em>Canyon de Chelly: Rabbit Brush</em>",n.d.,"<strong>LUNGREN</strong>, Fernand","Fernand Lungren Bequest",1964.707,,,,,,,,,,,,,,,,,,,,,,,,,,,,,,,,,,,,,,,,,,,,,"19th century,20th century,brush,canvas,Desert,landscape,oil,Painting",http://art-collections.museum.ucsb.edu/files/original/00d66e3ed6dd70d9379f0a5274780d3c.jpg,"Physical Object","<strong>The Fernand Lungren Bequest</strong>",1,0
"<strong>LUNGREN</strong>, Fernand","<em>Desert Wash</em>",n.d.,"<strong>LUNGREN</strong>, Fernand","Fernand Lungren Bequest",1964.706,,,,,,,,,,,,,,,,,,,,,,,,,,,,,,,,,,,,,,,,,,,,,,,"Physical Object","<strong>The Fernand Lungren Bequest</strong>",1,0
"<strong>LUNGREN</strong>, Fernand","<em>Arm of the Grand Canyon</em>",n.d.,"<strong>LUNGREN</strong>, Fernand","Fernand Lungren Bequest",1964.705,,,,,,,,,,,,,,,,,,,,,,,,,,,,,,,,,,,,,,,,,,,,,"19th century,20th century,Arizona,Grand Canyon,landscape,oil,Painting",http://art-collections.museum.ucsb.edu/files/original/6f4c592021986ae15fe50ace1cd45a58.jpg,"Physical Object","<strong>The Fernand Lungren Bequest</strong>",1,0
"<strong>LUNGREN</strong>, Fernand","<em>The Sentinel</em>",n.d.,"<strong>LUNGREN</strong>, Fernand","Fernand Lungren Bequest",1964.704,,,,,,,,,,,,,,,,,,,,,,,,,,,,,,,,,,,,,,,,,,,,,"19th century,20th century,canvas,oil,Painting,sentinel,still life",http://art-collections.museum.ucsb.edu/files/original/7c780012aaf9c35624ed9f68d81b458c.jpg,"Physical Object","<strong>The Fernand Lungren Bequest</strong>",1,0
"<strong>LUNGREN</strong>, Fernand","End of Inyo Range (unfinished)",n.d.,"<strong>LUNGREN</strong>, Fernand","Fernand Lungren Bequest",1964.703,,,,,,,,,,,,,,,,,,,,,,,,,,,,,,,,,,,,,,,,,,,,,,,"Physical Object","<strong>The Fernand Lungren Bequest</strong>",1,0
"<strong>LUNGREN</strong>, Fernand",<em>Rockets</em>,1899-1901,"<strong>LUNGREN</strong>, Fernand","Fernand Lungren Bequest",1964.702,,,,,,,,,,,,,,,,,,,,,,,,,,,,,,,,,,,,,,,,,,,,,"19th century,20th century,fireworks,landscape,Night,oil,Painting",http://art-collections.museum.ucsb.edu/files/original/eb07f222ce2168797343c9992107b98f.jpg,"Physical Object","<strong>The Fernand Lungren Bequest</strong>",1,0
"<strong>LUNGREN</strong>, Fernand","<em>Pink Cloud</em>",n.d.,"<strong>LUNGREN</strong>, Fernand","Fernand Lungren Bequest",1964.701,,,,,,,,,,,,,,,,,,,,,,,,,,,,,,,,,,,,,,,,,,,,,"19th century,20th century,Cloud,landscape,oil,Painting,pink",http://art-collections.museum.ucsb.edu/files/original/f0642c13a06dcddd3053906fd434b0d1.jpg,"Physical Object","<strong>The Fernand Lungren Bequest</strong>",1,0
"<strong>LUNGREN</strong>, Fernand","<em>Across the Sage</em>",n.d.,"<strong>LUNGREN</strong>, Fernand","Fernand Lungren Bequest",1964.700,,,,,,,,,,,,,,,,,,,,,,,,,,,,,,,,,,,,,,,,,,,,,,,"Physical Object","<strong>The Fernand Lungren Bequest</strong>",1,0
"<strong>LUNGREN</strong>, Fernand","<em>Poppies and Lup</em>in",n.d.,"<strong>LUNGREN</strong>, Fernand","Fernand Lungren Bequest",1964.699,,,,,,,,,,,,,,,,,,,,,,,,,,,,,,,,,,,,,,,,,,,,,,,"Physical Object","<strong>The Fernand Lungren Bequest</strong>",1,0
"<strong>LUNGREN</strong>, Fernand","<em>Golden CottonWoods</em>",n.d.,"<strong>LUNGREN</strong>, Fernand","Fernand Lungren Bequest",1964.698,,,,,,,,,,,,,,,,,,,,,,,,,,,,,,,,,,,,,,,,,,,,,,,"Physical Object","<strong>The Fernand Lungren Bequest</strong>",1,0
"<strong>LUNGREN</strong>, Fernand","<em>Panamint Valley: Late Afternoon</em>",n.d.,"<strong>LUNGREN,</strong> Fernand","Fernand Lungren Bequest",1964.697,,,,,,,,,,,,,,,,,,,,,,,,,,,,,,,,,,,,,,,,,,,,,"19th century,20th century,canvas,landscape,mountains,oil,Painting,Valley",http://art-collections.museum.ucsb.edu/files/original/b32e52771ab4998c62fc2383a7053151.jpg,"Physical Object","<strong>The Fernand Lungren Bequest</strong>",1,0
"<strong>LUNGREN</strong>, Fernand","<em>Rabbit Brush in Bloom</em>",n.d.,"<strong>LUNGREN</strong>, Fernand","Fernand Lungren Bequest",1964.696.B,,,,,,,,,,,,,,,,,,,,,,,,,,,,,,,,,,,,,,,,,,,,,"19th century,20th century,brush,canvas,canyon,landscape,oil,Painting",http://art-collections.museum.ucsb.edu/files/original/49162cd51f5f33ed50e9aa2499efcdb9.jpg,"Physical Object","<strong>The Fernand Lungren Bequest</strong>",1,0
"<strong>LUNGREN</strong>, Fernand","<em>Grand Canyon</em>","ca. 1910","<strong>LUNGREN</strong>, Fernand","Fernand Lungren Bequest",1964.696,,,,,,,,,,,,,,,,,,,,,,,,,,,,,,,,,,,,,,,,,,,,,"19th century,20th century,Grand Canyon,landscape,oil,Painting",http://art-collections.museum.ucsb.edu/files/original/2cbfe75bc33200eea1a3dfbee12691cd.jpg,"Physical Object","<strong>The Fernand Lungren Bequest</strong>",1,0
"<strong>LUNGREN</strong>, Fernand","<em>In a Canyon (Calico)</em>",n.d.,"<strong>LUNGREN</strong>, Fernand","Fernand Lungren Bequest",1964.695,,,,,,,,,,,,,,,,,,,,,,,,,,,,,,,,,,,,,,,,,,,,,,,"Physical Object","<strong>The Fernand Lungren Bequest</strong>",1,0
"<strong>LUNGREN</strong>, Fernand","<em>Lower Red Rock Canyon</em>",n.d.,"<strong>LUNGREN</strong>, Fernand","Fernand Lungren Bequest",1964.694,,,,,,,,,,,,,,,,,,,,,,,,,,,,,,,,,,,,,,,,,,,,,"19th century,20th century,canyon,Desert,landscape,oil,Painting,red rock",http://art-collections.museum.ucsb.edu/files/original/b8bb4bbbe5f4b3dd705f5ac2892ed8d8.jpg,"Physical Object","<strong>The Fernand Lungren Bequest</strong>",1,0
"<strong>LUNGREN</strong>, Fernand","<em>Cotton Woods: Owens Valley</em>","ca. 1910","<strong>LUNGREN</strong>, Fernand","Fernand Lungren Bequest",1964.693,,,,,,,,,,,,,,,,,,,,,,,,,,,,,,,,,,,,,,,,,,,,,,,"Physical Object","<strong>The Fernand Lungren Bequest</strong>",1,0
"<strong>LUNGREN</strong>, Fernand",<em>Thirst</em>,"ca. 1893-97","<strong>LUNGREN</strong>, Fernand","Fernand Lungren Bequest",1964.692,,,,,,,,,,,,,,,,,,,,,,,,,,,,,,,,,,,,,,,,,,,,,"19th century,20th century,canvas,landscape,oil,Painting",http://art-collections.museum.ucsb.edu/files/original/0762cd7de7ad5434485bba73f9256582.jpg,"Physical Object","<strong>The Fernand Lungren Bequest</strong>",1,0
"<strong>LUNGREN</strong>, Fernand","<em>Rivers of Stone</em>","ca. 1897","<strong>LUNGREN</strong>, Fernand","Fernand Lungren Bequest",1964.691,,,,,,,,,,,,,,,,,,,,,,,,,,,,,,,,,,,,,,,,,,,,,"19th century,20th century,brush,canvas,landscape,oil,Painting,stone",http://art-collections.museum.ucsb.edu/files/original/8414f6cfe107837e501a939b76e87b79.jpg,"Physical Object","<strong>The Fernand Lungren Bequest</strong>",1,0
"<strong>LUNGREN</strong>, Fernand","<em>Entrance to Canyon del Muerto from Canyon de Chelly</em>",n.d.,"<strong>LUNGREN</strong>, Fernand","Fernand Lungren Bequest",1964.690,,,,,,,,,,,,,,,,,,,,,,,,,,,,,,,,,,,,,,,,,,,,,"19th century,20th century,canvas,canyon,landscape,oil,Painting,pink",http://art-collections.museum.ucsb.edu/files/original/946c004fe51762d0647e6a1505cc44d2.jpg,"Physical Object","<strong>The Fernand Lungren Bequest</strong>",1,0
"<strong>LUNGREN</strong>, Fernand","<em>Mountain Lake: High Sierra</em>","ca. 1904-05 (or later)","<strong>LUNGREN</strong>, Fernand","Fernand Lungren Bequest",1964.689,,,,,,,,,,,,,,,,,,,,,,,,,,,,,,,,,,,,,,,,,,,,,"19th century,20th century,canvas,high sierra,landscape,mountain lake,oil,Painting",http://art-collections.museum.ucsb.edu/files/original/4b9844e677baed0d8524b0b792104b59.jpg,"Physical Object","<strong>The Fernand Lungren Bequest</strong>",1,0
"<strong>LUNGREN</strong>, Fernand","<em>The Canyon Wall</em>",n.d.,"<strong>LUNGREN</strong>, Fernand","Fernand Lungren Bequest",1964.688,,,,,,,,,,,,,,,,,,,,,,,,,,,,,,,,,,,,,,,,,,,,,,,"Physical Object","<strong>The Fernand Lungren Bequest</strong>",1,0
"<strong>LUNGREN</strong>, Fernand","<em>The Green Avenue</em>",n.d.,"<strong>LUNGREN</strong>, Fernand","Fernand Lungren Bequest",1964.687,,,,,,,,,,,,,,,,,,,,,,,,,,,,,,,,,,,,,,,,,,,,,,,"Physical Object","<strong>The Fernand Lungren Bequest</strong>",1,0
"<strong>LUNGREN</strong>, Fernand","<em>In the Park</em>",n.d.,"<strong>LUNGREN</strong>, Fernand","Fernand Lungren Bequest",1964.686,,,,,,,,,,,,,,,,,,,,,,,,,,,,,,,,,,,,,,,,,,,,,"19th century,20th century,canvas,cityscape,landscape,oil,Painting,street",http://art-collections.museum.ucsb.edu/files/original/971634540923a7e3e315ec43bc636eb3.jpg,"Physical Object","<strong>The Fernand Lungren Bequest</strong>",1,0
"<strong>LUNGREN</strong>, Fernand","<em>Trafalgar Square</em>","19th-20th C","<strong>LUNGREN</strong>, Fernand","Fernand Lungren Bequest",1964.685,,,,,,,,,,,,,,,,,,,,,,,,,,,,,,,,,,,,,,,,,,,,,"19th century,20th century,landscape,London,oil,Painting,Trafalgar Square",http://art-collections.museum.ucsb.edu/files/original/3f722c1c509bbbac7104d8ed2d604f35.jpg,"Physical Object","<strong>The Fernand Lungren Bequest</strong>",1,0
"<strong>LUNGREN</strong>, Fernand","<em>City Nocturne</em>",n.d.,"<strong>LUNGREN</strong>, Fernand","Fernand Lungren Bequest",1964.684,,,,,,,,,,,,,,,,,,,,,,,,,,,,,,,,,,,,,,,,,,,,,"19th century,20th century,Desert,landscape,oil,Painting",http://art-collections.museum.ucsb.edu/files/original/9432327ae028a90c487ba3565d0c248d.jpg,"Physical Object","<strong>The Fernand Lungren Bequest</strong>",1,0
"<strong>LUNGREN</strong>, Fernand","<em>A Wet Day</em>",n.d.,"<strong>LUNGREN</strong>, Fernand","Fernand Lungren Bequest",1964.683,,,,,,,,,,,,,,,,,,,,,,,,,,,,,,,,,,,,,,,,,,,,,,,"Physical Object","<strong>The Fernand Lungren Bequest</strong>",1,0
"<strong>LUNGREN</strong>, Fernand","<em>Rainy Night: London</em>",n.d.,"<strong>LUNGREN</strong>, Fernand","Fernand Lungren Bequest",1964.682,,,,,,,,,,,,,,,,,,,,,,,,,,,,,,,,,,,,,,,,,,,,,,,"Physical Object","<strong>The Fernand Lungren Bequest</strong>",1,0
"<strong>LUNGREN</strong>, Fernand","<em>Lungren's Home, Mission Canyo</em>n",n.d.,"<strong>LUNGREN</strong>, Fernand","Fernand Lungren Bequest",1964.681,,,,,,,,,,,,,,,,,,,,,,,,,,,,,,,,,,,,,,,,,,,,,,,"Physical Object","<strong>The Fernand Lungren Bequest</strong>",1,0
"<strong>LUNGREN</strong>, Fernand","<em>Silver River</em>",n.d.,"<strong>LUNGREN</strong>, Fernand","Fernand Lungren Bequest",1964.680,,,,,,,,,,,,,,,,,,,,,,,,,,,,,,,,,,,,,,,,,,,,,"19th century,20th century,landscape,oil,Painting,river,Valley",http://art-collections.museum.ucsb.edu/files/original/51f0fd7a3b77b1f357387114591653b0.jpg,"Physical Object","<strong>The Fernand Lungren Bequest</strong>",1,0
"<strong>LUNGREN</strong>, Fernand","<em>Flaming Cliffs</em>",n.d.,"<strong>LUNGREN</strong>, Fernand","Fernand Lungren Bequest",1964.678,,,,,,,,,,,,,,,,,,,,,,,,,,,,,,,,,,,,,,,,,,,,,,,"Physical Object","<strong>The Fernand Lungren Bequest</strong>",1,0