﻿"Dublin Core:Title","Dublin Core:Description","Dublin Core:Date","Dublin Core:Creator","Dublin Core:Source","Dublin Core:Identifier","Dublin Core:Contributor","Dublin Core:Rights","Dublin Core:Relation","Dublin Core:Format","Dublin Core:Language","Dublin Core:Type","Dublin Core:Coverage","Dublin Core:Subject","Dublin Core:Publisher","Item Type Metadata:Birth Date","Item Type Metadata:Birthplace","Item Type Metadata:Event Type","Item Type Metadata:Participants","Item Type Metadata:URL","Item Type Metadata:Death Date","Item Type Metadata:Occupation","Item Type Metadata:Biographical Text","Item Type Metadata:Bibliography","Item Type Metadata:File name","Item Type Metadata:Time Summary","Item Type Metadata:Interviewer","Item Type Metadata:Interviewee","Item Type Metadata:Location","Item Type Metadata:Transcription","Item Type Metadata:Local URL","Item Type Metadata:Original Format","Item Type Metadata:Physical Dimensions","Item Type Metadata:Duration","Item Type Metadata:Compression","Item Type Metadata:Producer","Item Type Metadata:Director","Item Type Metadata:Bit Rate/Frequency","Item Type Metadata:Text","Item Type Metadata:Email Body","Item Type Metadata:Subject Line","Item Type Metadata:From","Item Type Metadata:To","Item Type Metadata:CC","Item Type Metadata:BCC","Item Type Metadata:Number of Attachments","Item Type Metadata:Standards","Item Type Metadata:Objectives","Item Type Metadata:Materials","Item Type Metadata:Tags",tags,file,itemType,collection,public,featured
"<strong>AFRICAN, KASAI PROVINCE, BELGIAN CONGO</strong>",<em>Head</em>,n.d.,"African, Kasai Province, Belgian Congo","Margaret Mallory Collection of African Ethnological Material",1964.160.31,,,,,,,,,,,,,,,,,,,,,,,,,,,,,,,,,,,,,,,,,,,,,,,"Physical Object","<strong>The Margaret Mallory Bequest</strong>",1,0
"<strong>AFRICAN, KASAI PROVINCE, BELGIAN CONGO</strong>","<em>Reptile Skin</em>",n.d.,"African, Kasai Province, Belgian Congo","Margaret Mallory Collection of African Ethnological Material",1964.160.316,,,,,,,,,,,,,,,,,,,,,,,,,,,,,,,,,,,,,,,,,,,,,,,"Physical Object","<strong>The Margaret Mallory Bequest</strong>",1,0
"<strong>AFRICAN, BELGIAN CONGO, KUBA PEOPLES</strong>","<em>Mukyeem Mask</em>",n.d.,"African, Belgian Congo, Kuba Peoples","Margaret Mallory Collection of African Ethnological Material",1964.160.318.a-c,,,,,,,,,,,,,,,,,,,,,,,,,,,,,,,,,,,,,,,,,,,,,"cowry shells,Fiber,glass beads,leopard skin,Mask,metal,Physical-Object,Textiles,Wood",http://art-collections.museum.ucsb.edu/files/original/45a159bb92961312290ddefa17b3f4e6.jpg,"Physical Object","<strong>The Margaret Mallory Bequest</strong>",1,0
"<strong>AFRICAN, KASAI PROVINCE, BELGIAN CONGO</strong>","<em>Headdress and Costume</em>",n.d.,"African, Kasai Province, Belgian Congo","Margaret Mallory Collection of African Ethnological Material",1964.160.319,,,,,,,,,,,,,,,,,,,,,,,,,,,,,,,,,,,,,,,,,,,,,,,"Physical Object","<strong>The Margaret Mallory Bequest</strong>",1,0
"<strong>AFRICAN, KASAI PROVINCE, BELGIAN CONGO</strong>",<em>Dog</em>,n.d.,"African, Kasai Province, Belgian Congo","Margaret Mallory Collection of African Ethnological Material",1964.160.32,,,,,,,,,,,,,,,,,,,,,,,,,,,,,,,,,,,,,,,,,,,,,,,"Physical Object","<strong>The Margaret Mallory Bequest</strong>",1,0
"<strong>AFRICAN, KASAI PROVINCE, BELGIAN CONGO</strong>",<em>Headdress</em>,n.d.,"African, Kasai Province, Belgian Congo","Margaret Mallory Collection of African Ethnological Material",1964.160.321,,,,,,,,,,,,,,,,,,,,,,,,,,,,,,,,,,,,,,,,,,,,,"African,Feathers,Fiber,grass,Headdress,Physical-Object,tar,Textile",http://art-collections.museum.ucsb.edu/files/original/c2eb3e57d5bf8bfdc98e47e1d737cd1b.JPG,"Physical Object","<strong>The Margaret Mallory Bequest</strong>",1,0
"<strong>AFRICAN, KASAI PROVINCE, BELGIAN CONGO</strong>",<em>Headdress</em>,n.d.,"African, Kasai Province, Belgian Congo","Margaret Mallory Collection of African Ethnological Material",1964.160.322,,,,,,,,,,,,,,,,,,,,,,,,,,,,,,,,,,,,,,,,,,,,,"African,fabric,Face,Feathers,Headdress,Physical-Object,string,tar,Textile,woven-grass","http://art-collections.museum.ucsb.edu/files/original/a2ab5d6906c01644d7b1f63d433ee2c8.jpg,http://art-collections.museum.ucsb.edu/files/original/7f3e213b02ecb9260cff0c43a29cd7d6.jpg","Physical Object","<strong>The Margaret Mallory Bequest</strong>",1,0
"<strong>AFRICAN, KASAI PROVINCE, BELGIAN CONGO</strong>","<em>Bark Cloth</em>",n.d.,"African, Kasai Province, Belgian Congo","Margaret Mallory Collection of African Ethnological Material",1964.160.325,,,,,,,,,,,,,,,,,,,,,,,,,,,,,,,,,,,,,,,,,,,,,,,"Physical Object","<strong>The Margaret Mallory Bequest</strong>",1,0
"<strong>AFRICAN, KASAI PROVINCE, BELGIAN CONGO</strong>","<em>Grass Mat</em>",n.d.,"African, Kasai Province, Belgian Congo","Margaret Mallory Collection of African Ethnological Material",1964.160.326,,,,,,,,,,,,,,,,,,,,,,,,,,,,,,,,,,,,,,,,,,,,,,,"Physical Object","<strong>The Margaret Mallory Bequest</strong>",1,0
"<strong>AFRICAN, KASAI PROVINCE, BELGIAN CONGO</strong>","<em>Grass Mat</em>",n.d.,"African, Kasai Province, Belgian Congo","Margaret Mallory Collection of African Ethnological Material",1964.160.327,,,,,,,,,,,,,,,,,,,,,,,,,,,,,,,,,,,,,,,,,,,,,,,"Physical Object","<strong>The Margaret Mallory Bequest</strong>",1,0
"<strong>AFRICAN, KASAI PROVINCE, BELGIAN CONGO</strong>","<em>Grass Mat</em>",n.d.,"African, Kasai Province, Belgian Congo","Margaret Mallory Collection of African Ethnological Material",1964.160.328,,,,,,,,,,,,,,,,,,,,,,,,,,,,,,,,,,,,,,,,,,,,,,,"Physical Object","<strong>The Margaret Mallory Bequest</strong>",1,0
"<strong>AFRICAN, KASAI PROVINCE, BELGIAN CONGO</strong>","<em>Grass Mat</em>",n.d.,"African, Kasai Province, Belgian Congo","Margaret Mallory Collection of African Ethnological Material",1964.160.329,,,,,,,,,,,,,,,,,,,,,,,,,,,,,,,,,,,,,,,,,,,,,,,"Physical Object","<strong>The Margaret Mallory Bequest</strong>",1,0
"<strong>AFRICAN, KASAI PROVINCE, BELGIAN CONGO</strong>",<em>Basket</em>,n.d.,"African, Kasai Province, Belgian Congo","Margaret Mallory Collection of African Ethnological Material",1964.160.331,,,,,,,,,,,,,,,,,,,,,,,,,,,,,,,,,,,,,,,,,,,,,"African,Physical-Object,Sculpture,Textile,Wicker,Woven",http://art-collections.museum.ucsb.edu/files/original/50d7a091be2f6705dfee977e45a7261e.jpg,"Physical Object","<strong>The Margaret Mallory Bequest</strong>",1,0
"<strong>AFRICAN, KASAI PROVINCE, BELGIAN CONGO</strong>","<em>Burden Basket</em>",n.d.,"African, Kasai Province, Belgian Congo","Margaret Mallory Collection of African Ethnological Material",1964.160.332,,,,,,,,,,,,,,,,,,,,,,,,,,,,,,,,,,,,,,,,,,,,,"Basket,Physical-Object,Sculpture,Textile,Woven",http://art-collections.museum.ucsb.edu/files/original/5f57ca392505bfb0a74d303a22e89041.jpg,"Physical Object","<strong>The Margaret Mallory Bequest</strong>",1,0
<strong>UNKNOWN</strong>,"<em>Book plate: Ex Libris Margaret Pynchon Mallory</em>",n.d.,Unknown,"Gift of Margaret Mallory",1964.160.333,,,,,,,,,,,,,,,,,,,,,,,,,,,,,,,,,,,,,,,,,,,,,,,"Physical Object","<strong>The Margaret Mallory Bequest</strong>",1,0
"<strong>AFRICAN, KASAI PROVINCE, BELGIAN CONGO</strong>","<em>Female Figurine</em>",n.d.,"African, Kasai Province, Belgian Congo","Margaret Mallory Collection of African Ethnological Material",1964.160.34,,,,,,,,,,,,,,,,,,,,,,,,,,,,,,,,,,,,,,,,,,,,,,,"Physical Object","<strong>The Margaret Mallory Bequest</strong>",1,0
"<strong>AFRICAN, KASAI PROVINCE, BELGIAN CONGO</strong>","<em>Female Figurine</em>",n.d.,"African, Kasai Province, Belgian Congo","Margaret Mallory Collection of African Ethnological Material",1964.160.35,,,,,,,,,,,,,,,,,,,,,,,,,,,,,,,,,,,,,,,,,,,,,,,"Physical Object","<strong>The Margaret Mallory Bequest</strong>",1,0
"<strong>AFRICAN, KASAI PROVINCE, BELGIAN CONGO</strong>","<em>Figurine with Grass Skirt</em>",n.d.,"African, Kasai Province, Belgian Congo","Margaret Mallory Collection of African Ethnological Material",1964.160.36,,,,,,,,,,,,,,,,,,,,,,,,,,,,,,,,,,,,,,,,,,,,,,,"Physical Object","<strong>The Margaret Mallory Bequest</strong>",1,0
"<strong>AFRICAN, KASAI PROVINCE, BELGIAN CONGO</strong>",<em>Whistle</em>,n.d.,"African, Kasai Province, Belgian Congo","Margaret Mallory Collection of African Ethnological Material",1964.160.38,,,,,,,,,,,,,,,,,,,,,,,,,,,,,,,,,,,,,,,,,,,,,"anthropomorphic,Physical-Object,Sculpture,Whistle,Wood",http://art-collections.museum.ucsb.edu/files/original/f459ea6c4fa12ea5c59f89851696bb83.jpg,"Physical Object","<strong>The Margaret Mallory Bequest</strong>",1,0
"<strong>AFRICAN, KASAI PROVINCE, BELGIAN CONGO</strong>","<em>Anthropomorphic Bird</em>",n.d.,"African, Kasai Province, Belgian Congo","Margaret Mallory Collection of African Ethnological Material",1964.160.39,,,,,,,,,,,,,,,,,,,,,,,,,,,,,,,,,,,,,,,,,,,,,,,"Physical Object","<strong>The Margaret Mallory Bequest</strong>",1,0
"<strong>AFRICAN, KASAI PROVINCE, BELGIAN CONGO</strong>","<em>Prestige Drinking Vessel</em>",n.d.,"African, Kasai Province, Belgian Congo","Margaret Mallory Collection of African Ethnological Material",1964.160.40,,,,,,,,,,,,,,,,,,,,,,,,,,,,,,,,,,,,,,,,,,,,,"brass-studs,Drinking Vessel,Physical-Object,Sculpture,Wood Relief",http://art-collections.museum.ucsb.edu/files/original/8e65c7ce86ef12955301fb0d34e3199e.jpg,"Physical Object","<strong>The Margaret Mallory Bequest</strong>",1,0
"<strong>AFRICAN, KASAI PROVINCE, BELGIAN CONGO</strong>",<em>Comb</em>,n.d.,"African, Kasai Province, Belgian Congo","Margaret Mallory Collection of African Ethnological Material",1964.160.41,,,,,,,,,,,,,,,,,,,,,,,,,,,,,,,,,,,,,,,,,,,,,"African,Comb,grass,Physical-Object,Sculpture,Wood,Woven",http://art-collections.museum.ucsb.edu/files/original/60b70bbf0e38e99d6837b3daf3170296.jpg,"Physical Object","<strong>The Margaret Mallory Bequest</strong>",1,0
"<strong>AFRICAN, KASAI PROVINCE, BELGIAN CONGO</strong>","<em>Double Basket</em>",n.d.,"African, Kasai Province, Belgian Congo","Margaret Mallory Collection of African Ethnological Material",1964.160.42,,,,,,,,,,,,,,,,,,,,,,,,,,,,,,,,,,,,,,,,,,,,,,,"Physical Object","<strong>The Margaret Mallory Bequest</strong>",1,0
"<strong>AFRICAN, KASAI PROVINCE, BELGIAN CONGO</strong>","<em>Double Basket</em>",n.d.,"African, Kasai Province, Belgian Congo","Margaret Mallory Collection of African Ethnological Material",1964.160.43,,,,,,,,,,,,,,,,,,,,,,,,,,,,,,,,,,,,,,,,,,,,,,,"Physical Object","<strong>The Margaret Mallory Bequest</strong>",1,0
"<strong>AFRICAN, KASAI PROVINCE, BELGIAN CONGO</strong>",<em>Basket</em>,n.d.,"African, Kasai Province, Belgian Congo","Margaret Mallory Collection of African Ethnological Material",1964.160.44,,,,,,,,,,,,,,,,,,,,,,,,,,,,,,,,,,,,,,,,,,,,,"Basket,hat,Physical-Object,Textile,Wicker,Woven","http://art-collections.museum.ucsb.edu/files/original/b132dc943c205f223e4762797ce11e30.jpg,http://art-collections.museum.ucsb.edu/files/original/9b7e2041be4b354e9392dedc876b2d8e.jpg","Physical Object","<strong>The Margaret Mallory Bequest</strong>",1,0
"<strong>AFRICAN, KASAI PROVINCE, BELGIAN CONGO</strong>","<em>Basket Hat</em>",n.d.,"African, Kasai Province, Belgian Congo","Margaret Mallory Collection of African Ethnological Material",1964.160.45,,,,,,,,,,,,,,,,,,,,,,,,,,,,,,,,,,,,,,,,,,,,,"Basket,hat,Physical-Object,Raffia,Textile,Woven",http://art-collections.museum.ucsb.edu/files/original/ac6d61b66ae4f79236f67dd2a4f6f70b.jpg,"Physical Object","<strong>The Margaret Mallory Bequest</strong>",1,0
"<strong>AFRICAN, KASAI PROVINCE, BELGIAN CONGO</strong>",<em>Fragment</em>,n.d.,"African, Kasai Province, Belgian Congo","Margaret Mallory Collection of African Ethnological Material",1964.160.46,,,,,,,,,,,,,,,,,,,,,,,,,,,,,,,,,,,,,,,,,,,,,,,"Physical Object","<strong>The Margaret Mallory Bequest</strong>",1,0
"<strong>AFRICAN, KASAI PROVINCE, BELGIAN CONGO</strong>",<em>Rope</em>,n.d.,"African, Kasai Province, Belgian Congo","Margaret Mallory Collection of African Ethnological Material",1964.160.48,,,,,,,,,,,,,,,,,,,,,,,,,,,,,,,,,,,,,,,,,,,,,,,"Physical Object","<strong>The Margaret Mallory Bequest</strong>",1,0
"<strong>AFRICAN, KASAI PROVINCE, BELGIAN CONGO</strong>",<em>Belt</em>,n.d.,"African, Kasai Province, Belgian Congo","Margaret Mallory Collection of African Ethnological Material",1964.160.49,,,,,,,,,,,,,,,,,,,,,,,,,,,,,,,,,,,,,,,,,,,,,"Beads,Belt,Blue,Cloth,grass,Leather,Physical-Object,red,Textile,Triangle,White","http://art-collections.museum.ucsb.edu/files/original/ffd1e06b46ab6a8ef28fd061cfd64810.jpg,http://art-collections.museum.ucsb.edu/files/original/35adcbd35387793fb860ef32b43383a1.jpg","Physical Object","<strong>The Margaret Mallory Bequest</strong>",1,0
"<strong>AFRICAN, KASAI PROVINCE, BELGIAN CONGO</strong>",<em>Belt</em>,n.d.,"African, Kasai Province, Belgian Congo","Margaret Mallory Collection of African Ethnological Material",1964.160.50,,,,,,,,,,,,,,,,,,,,,,,,,,,,,,,,,,,,,,,,,,,,,"Beads,Belt,Black,Cloth,grass,Leather,Physical-Object,Textile,Triangle,White",http://art-collections.museum.ucsb.edu/files/original/855e3a121b2fd4e47b64a7bfe2902896.jpg,"Physical Object","<strong>The Margaret Mallory Bequest</strong>",1,0
"<strong>AFRICAN, KASAI PROVINCE, BELGIAN CONGO</strong>",<em>Belt</em>,n.d.,"African, Kasai Province, Belgian Congo","Margaret Mallory Collection of African Ethnological Material",1964.160.51,,,,,,,,,,,,,,,,,,,,,,,,,,,,,,,,,,,,,,,,,,,,,"Beads,Belt,Blue,Cloth,grass,Leather,Physical-Object,Textile,Triangle,White","http://art-collections.museum.ucsb.edu/files/original/ff5b9e4fdd39796ee87c008e68283cb0.jpg,http://art-collections.museum.ucsb.edu/files/original/3a54cc5d0cb268903ed25d96025fa9bb.jpg","Physical Object","<strong>The Margaret Mallory Bequest</strong>",1,0
"<strong>AFRICAN, KASAI PROVINCE, BELGIAN CONGO</strong>",<em>Cloth</em>,n.d.,"African, Kasai Province, Belgian Congo","Margaret Mallory Collection of African Ethnological Material",1964.160.523,,,,,,,,,,,,,,,,,,,,,,,,,,,,,,,,,,,,,,,,,,,,,"African,Cloth,Palm-fiber,Physical-Object,Textiles,Yellow","http://art-collections.museum.ucsb.edu/files/original/835da8930351cfb688da3555aa3fdec3.jpg,http://art-collections.museum.ucsb.edu/files/original/92b0d848bb3774ba79d257c184b5eff6.jpg","Physical Object","<strong>The Margaret Mallory Bequest</strong>",1,0
"<strong>AFRICAN, KASAI PROVINCE, BELGIAN CONGO</strong>","<em>Short Sword</em>",n.d.,"African, Kasai Province, Belgian Congo","Margaret Mallory Collection of African Ethnological Material",1964.160.53,,,,,,,,,,,,,,,,,,,,,,,,,,,,,,,,,,,,,,,,,,,,,,,"Physical Object","<strong>The Margaret Mallory Bequest</strong>",1,0
"<strong>AFRICAN, KASAI PROVINCE, BELGIAN CONGO</strong>","<em>Short Sword</em>",n.d.,"African, Kasai Province, Belgian Congo","Margaret Mallory Collection of African Ethnological Material",1964.160.54,,,,,,,,,,,,,,,,,,,,,,,,,,,,,,,,,,,,,,,,,,,,,,,"Physical Object","<strong>The Margaret Mallory Bequest</strong>",1,0
"<strong>AFRICAN, KASAI PROVINCE, BELGIAN CONGO</strong>",<em>Scabbard</em>,n.d.,"African, Kasai Province, Belgian Congo","Margaret Mallory Collection of African Ethnological Material",1964.160.58,,,,,,,,,,,,,,,,,,,,,,,,,,,,,,,,,,,,,,,,,,,,,"African,Leather,Physical-Object,Scabbard,Sculpture",http://art-collections.museum.ucsb.edu/files/original/8db69739525406741e7038ed5ed32dcf.JPG,"Physical Object","<strong>The Margaret Mallory Bequest</strong>",1,0
"<strong>AFRICAN, KASAI PROVINCE, BELGIAN CONGO</strong>",<em>Scabbard</em>,n.d.,"African, Kasai Province, Belgian Congo","Margaret Mallory Collection of African Ethnological Material",1964.160.60,,,,,,,,,,,,,,,,,,,,,,,,,,,,,,,,,,,,,,,,,,,,,"African,Leather,Physical-Object,Scabbard,Sculpture,Wood",http://art-collections.museum.ucsb.edu/files/original/563e23d169abb4b8a9a1993d66ee1c0d.JPG,"Physical Object","<strong>The Margaret Mallory Bequest</strong>",1,0
"<strong>AFRICAN, KASAI PROVINCE, BELGIAN CONGO</strong>",<em>Scabbard</em>,n.d.,"African, Kasai Province, Belgian Congo","Margaret Mallory Collection of African Ethnological Material",1964.160.62,,,,,,,,,,,,,,,,,,,,,,,,,,,,,,,,,,,,,,,,,,,,,"African,Copper-Studs,Leather,Physical-Object,Scabbard,Sculpture,Wood",http://art-collections.museum.ucsb.edu/files/original/c9fcc6b8253437441e0eccfe97f7a174.jpg,"Physical Object","<strong>The Margaret Mallory Bequest</strong>",1,0
"<strong>AFRICAN, KASAI PROVINCE, BELGIAN CONGO</strong>",<em>Scabbard</em>,n.d.,"African, Kasai Province, Belgian Congo","Margaret Mallory Collection of African Ethnological Material",1964.160.64,,,,,,,,,,,,,,,,,,,,,,,,,,,,,,,,,,,,,,,,,,,,,"African,Leather,Physical-Object,Scabbard,Sculpture,Wood",http://art-collections.museum.ucsb.edu/files/original/39363b7ed3d7b4c3f65651e809c0c683.JPG,"Physical Object","<strong>The Margaret Mallory Bequest</strong>",1,0
"<strong>AFRICAN, KASAI PROVINCE, BELGIAN CONGO</strong>","<em>Short Sword</em>",n.d.,"African, Kasai Province, Belgian Congo","Margaret Mallory Collection of African Ethnological Material",1964.160.67,,,,,,,,,,,,,,,,,,,,,,,,,,,,,,,,,,,,,,,,,,,,,"African,brass,Iron,Leather,Physical-Object,Sculpture,Short,Sword,weapon,Wood",http://art-collections.museum.ucsb.edu/files/original/4249dfa3ea94a35a908bdc784ef6595f.jpg,"Physical Object","<strong>The Margaret Mallory Bequest</strong>",1,0
"<strong>AFRICAN, KASAI PROVINCE, BELGIAN CONGO</strong>",<em>Scabbard</em>,n.d.,"African, Kasai Province, Belgian Congo","Margaret Mallory Collection of African Ethnological Material",1964.160.68,,,,,,,,,,,,,,,,,,,,,,,,,,,,,,,,,,,,,,,,,,,,,,,"Physical Object","<strong>The Margaret Mallory Bequest</strong>",1,0
"<strong>AFRICAN, KASAI PROVINCE, BELGIAN CONGO</strong>","<em>Double cup with handle</em>","20th C.","African, Kasai Province, Belgian Congo","Margaret Mallory Collection of African Ethnological Material",1964.160.7,,,,,,,,,,,,,,,,,,,,,,,,,,,,,,,,,,,,,,,,,,,,,"African,Carved,Double-Cup,Physical-Object,Sculpture,Wood","http://art-collections.museum.ucsb.edu/files/original/931a249502026fb6fa99c5032f5cef88.JPG,http://art-collections.museum.ucsb.edu/files/original/c8dd15186309c9fe54daa6fa0a24d8b9.jpg","Physical Object","<strong>The Margaret Mallory Bequest</strong>",1,0
"<strong>AFRICAN, KASAI PROVINCE, BELGIAN CONGO</strong>",<em>Sickle</em>,n.d.,"African, Kasai Province, Belgian Congo","Margaret Mallory Collection of African Ethnological Material",1964.160.72,,,,,,,,,,,,,,,,,,,,,,,,,,,,,,,,,,,,,,,,,,,,,"African,Iron,Physical-Object,Sculpture,Sickle,weapon,Wood",http://art-collections.museum.ucsb.edu/files/original/83ccd4eab554ffbdf9f1aa0ab32bd8dd.jpg,"Physical Object","<strong>The Margaret Mallory Bequest</strong>",1,0
"<strong>AFRICAN, KASAI PROVINCE, BELGIAN CONGO</strong>",<em>Sickle</em>,n.d.,"African, Kasai Province, Belgian Congo","Margaret Mallory Collection of African Ethnological Material",1964.160.73,,,,,,,,,,,,,,,,,,,,,,,,,,,,,,,,,,,,,,,,,,,,,"African,Iron,Physical-Object,Sculpture,Sickle,weapon,Wood",http://art-collections.museum.ucsb.edu/files/original/0967f9c1538b2a5ce0da1f85f179b8b3.jpg,"Physical Object","<strong>The Margaret Mallory Bequest</strong>",1,0
"<strong>AFRICAN, KASAI PROVINCE, BELGIAN CONGO</strong>",<em>Sickle</em>,n.d.,"African, Kasai Province, Belgian Congo","Margaret Mallory Collection of African Ethnological Material",1964.160.74,,,,,,,,,,,,,,,,,,,,,,,,,,,,,,,,,,,,,,,,,,,,,"African,Iron,Physical-Object,Sculpture,Sickle,weapon,Wood",http://art-collections.museum.ucsb.edu/files/original/f35d7c259a5c5d104af5bcbf3f71ff22.jpg,"Physical Object","<strong>The Margaret Mallory Bequest</strong>",1,0
"<strong>AFRICAN, KASAI PROVINCE, BELGIAN CONGO</strong>",<em>Sickle</em>,n.d.,"African, Kasai Province, Belgian Congo","Margaret Mallory Collection of African Ethnological Material",1964.160.75,,,,,,,,,,,,,,,,,,,,,,,,,,,,,,,,,,,,,,,,,,,,,"African,Brass-Wire,Iron,Physical-Object,Sculpture,Sickle,weapon,Wood",http://art-collections.museum.ucsb.edu/files/original/f454716481299f15b93dab122edf2e26.jpg,"Physical Object","<strong>The Margaret Mallory Bequest</strong>",1,0
"<strong>AFRICAN, KASAI PROVINCE, BELGIAN CONGO</strong>",<em>Axe</em>,n.d.,"African, Kasai Province, Belgian Congo","Margaret Mallory Collection of African Ethnological Material",1964.160.76,,,,,,,,,,,,,,,,,,,,,,,,,,,,,,,,,,,,,,,,,,,,,"Axe,Iron,Physical-Object,Sculpture,weapon,Wood",http://art-collections.museum.ucsb.edu/files/original/44853d1a2d9165592b1a2703eb8f13d1.jpg,"Physical Object","<strong>The Margaret Mallory Bequest</strong>",1,0
"<strong>AFRICAN, KASAI PROVINCE, BELGIAN CONGO</strong>","<em>Ceremonial Axe</em>",n.d.,"African, Kasai Province, Belgian Congo","Margaret Mallory Collection of African Ethnological Material",1964.160.79,,,,,,,,,,,,,,,,,,,,,,,,,,,,,,,,,,,,,,,,,,,,,"African,architecture,Axe,brass,brass-studs,Brass-Wire,ceremonial,Iron,Sculpture,weapon,Wood",http://art-collections.museum.ucsb.edu/files/original/2c2acdd7c5b02d10de7bb7fb5c5f4ecb.jpg,"Physical Object","<strong>The Margaret Mallory Bequest</strong>",1,0
"<strong>AFRICAN, KASAI PROVINCE, BELGIAN CONGO</strong>","<em>Ceremonial Axe</em>",n.d.,"African, Kasai Province, Belgian Congo","Margaret Mallory Collection of African Ethnological Material",1964.160.80,,,,,,,,,,,,,,,,,,,,,,,,,,,,,,,,,,,,,,,,,,,,,"African,architecture,Axe,brass,ceremonial,Iron,Sculpture,weapon,Wood",http://art-collections.museum.ucsb.edu/files/original/aa80e505188cf0f391bc9a5aba7e3dcd.jpg,"Physical Object","<strong>The Margaret Mallory Bequest</strong>",1,0
"<strong>AFRICAN, KASAI PROVINCE, BELGIAN CONGO</strong>","<em>Long Sickle</em>",n.d.,"African, Kasai Province, Belgian Congo","Margaret Mallory Collection of African Ethnological Material",1964.160.81,,,,,,,,,,,,,,,,,,,,,,,,,,,,,,,,,,,,,,,,,,,,,"African,architecture,Brass-Wire,Extended-Blade,Iron,Sculpture,Sickle,Wood",http://art-collections.museum.ucsb.edu/files/original/c07a95dd95a293f1ffb5186e81c00447.jpg,"Physical Object","<strong>The Margaret Mallory Bequest</strong>",1,0
"<strong>AFRICAN, KASAI PROVINCE, BELGIAN CONGO</strong>",<em>Sword</em>,n.d.,"African, Kasai Province, Belgian Congo","Margaret Mallory Collection of African Ethnological Material",1964.160.82,,,,,,,,,,,,,,,,,,,,,,,,,,,,,,,,,,,,,,,,,,,,,"African,architecture,Copper-Wire,Curved-Blade,Iron,Sculpture,Sword,Wood",http://art-collections.museum.ucsb.edu/files/original/2f53a96ea3c6cfe26762681fb5664cc1.jpg,"Physical Object","<strong>The Margaret Mallory Bequest</strong>",1,0
"<strong>AFRICAN, KASAI PROVINCE, BELGIAN CONGO</strong>","<em>Short Sword</em>",n.d.,"African Kasai Province, Belgian Congo","Margaret Mallory Collection of African Ethnological Material",1964.160.84,,,,,,,,,,,,,,,,,,,,,,,,,,,,,,,,,,,,,,,,,,,,,,,"Physical Object","<strong>The Margaret Mallory Bequest</strong>",1,0
"<strong>AFRICAN, KASAI PROVINCE, BELGIAN CONGO</strong>","<em>Ceremonial Spear</em>",n.d.,"African, Kasai Province, Belgian Congo","Margaret Mallory Collection of African Ethnological Material",1964.160.85,,,,,,,,,,,,,,,,,,,,,,,,,,,,,,,,,,,,,,,,,,,,,"African,architecture,ceremonial,Copper-Wire,Iron,Sculpture,Spear,Wood",http://art-collections.museum.ucsb.edu/files/original/2d3867bccc86e9cf36e82bff59a41fcc.jpg,"Physical Object","<strong>The Margaret Mallory Bequest</strong>",1,0
"<strong>AFRICAN, KASAI PROVINCE, BELGIAN CONGO</strong>",<em>Spear</em>,n.d.,"African, Kasai Province, Belgian Congo","Margaret Mallory Collection of African Ethnological Material",1964.160.86,,,,,,,,,,,,,,,,,,,,,,,,,,,,,,,,,,,,,,,,,,,,,"African,architecture,Iron,Iron-Wire,Sculpture,Spear,Wood",http://art-collections.museum.ucsb.edu/files/original/797439b9d75aed30a57939f64a38b41d.jpg,"Physical Object","<strong>The Margaret Mallory Bequest</strong>",1,0