﻿"Dublin Core:Title","Dublin Core:Description","Dublin Core:Date","Dublin Core:Creator","Dublin Core:Source","Dublin Core:Identifier","Dublin Core:Contributor","Dublin Core:Rights","Dublin Core:Relation","Dublin Core:Format","Dublin Core:Language","Dublin Core:Type","Dublin Core:Coverage","Dublin Core:Subject","Dublin Core:Publisher","Item Type Metadata:Birth Date","Item Type Metadata:Birthplace","Item Type Metadata:Event Type","Item Type Metadata:Participants","Item Type Metadata:URL","Item Type Metadata:Death Date","Item Type Metadata:Occupation","Item Type Metadata:Biographical Text","Item Type Metadata:Bibliography","Item Type Metadata:File name","Item Type Metadata:Time Summary","Item Type Metadata:Interviewer","Item Type Metadata:Interviewee","Item Type Metadata:Location","Item Type Metadata:Transcription","Item Type Metadata:Local URL","Item Type Metadata:Original Format","Item Type Metadata:Physical Dimensions","Item Type Metadata:Duration","Item Type Metadata:Compression","Item Type Metadata:Producer","Item Type Metadata:Director","Item Type Metadata:Bit Rate/Frequency","Item Type Metadata:Text","Item Type Metadata:Email Body","Item Type Metadata:Subject Line","Item Type Metadata:From","Item Type Metadata:To","Item Type Metadata:CC","Item Type Metadata:BCC","Item Type Metadata:Number of Attachments","Item Type Metadata:Standards","Item Type Metadata:Objectives","Item Type Metadata:Materials","Item Type Metadata:Tags",tags,file,itemType,collection,public,featured
"<strong>LEISTIKOW</strong>, Walter","<em>Waldsee (Forest Lake)</em>","19th - 20th Century","<strong>LEISTIKOW</strong>, Walter","Gift of Mr. and Mrs. Samuel Dorsky through UCSB Art Affiliates to the Ala Story Print Collection",1971.161,,,,,,,,,,,,,,,,,,,,,,,,,,,,,,,,,,,,,,,,,,,,,,http://art-collections.museum.ucsb.edu/files/original/c6da62ae73259e6b5fa2cf0e82dfe35a.jpg,"Physical Object","<strong>The Ala Story Print Collection</strong>",1,0
"<strong>LAURENS</strong>, Hendrick",<em>Faith</em>,n.d,"<strong>LAURENS</strong>, Hendrick","Ala Story Print Collection",1970.14,,,,,,,,,,,,,,,,,,,,,,,,,,,,,,,,,,,,,,,,,,,,,,http://art-collections.museum.ucsb.edu/files/original/822a77f16673034d39284afcf66c50f1.jpg,"Physical Object","<strong>The Ala Story Print Collection</strong>",1,0
"<strong>LAUGIER after Leon COGNIET</strong>",<em>Washington</em>,1839,"<strong>LAUGIER after Leon COGNIET</strong>","Gift of Walter Silva through the Art Affiliates to the Ala Story Print Collection",1971.13,,,,,,,,,,,,,,,,,,,,,,,,,,,,,,,,,,,,,,,,,,,,,,http://art-collections.museum.ucsb.edu/files/original/108e35c8494eb296da33cba03ca7dd03.jpg,"Physical Object","<strong>The Ala Story Print Collection</strong>",1,0
"<strong>KNELLER</strong>, Gottfried; <strong>VERTUE</strong>, George","<em>John Locke</em>",1738,"<strong>KNELLER</strong>, Gottfried; <strong>VERTUE</strong>, George","Ala Story Print Collection",1967.36,,,,,,,,,,,,,,,,,,,,,,,,,,,,,,,,,,,,,,,,,,,,,,http://art-collections.museum.ucsb.edu/files/original/59c393bd98b7d6f7869b468cb3ab7cc9.jpg,"Physical Object","<strong>The Ala Story Print Collection</strong>",1,0
"<strong>KLINGER</strong>, Max","<em>Roundel Book Plate for Fritz Gurlitt</em>",n.d,"<strong>KLINGER</strong>, Max","Gift of Mr. and Mrs. Samuel Dorsky through the Art Affiliates to the Ala Story Print Collection",1971.163,,,,,,,,,,,,,,,,,,,,,,,,,,,,,,,,,,,,,,,,,,,,,,http://art-collections.museum.ucsb.edu/files/original/05c3ec60062aee19c4f6685af901fe53.jpg,"Physical Object","<strong>The Ala Story Print Collection</strong>",1,0
"<strong>KENT</strong>, Frances Elizabeth called SISTER MARY CORITA","<em>The Great Pumpkin</em>",1964,"<strong>KENT</strong>, Frances Elizabeth called SISTER MARY CORITA","Anonymous gift to the Ala Story Print Collection",1969.11,,,,,,,,,,,,,,,,,,,,,,,,,,,,,,,,,,,,,,,,,,,,,,http://art-collections.museum.ucsb.edu/files/original/5d74bdb57281db5f1ab9dfbe3a139ed7.jpg,"Physical Object","<strong>The Ala Story Print Collection</strong>",1,0
"<strong>JONES</strong>, John Paul","<em>Imaginary Portrait Head</em>","20th century","<strong>JONES</strong>, John Paul","Gift of Dr. and Mrs. Eugene Anderson through the Art Affiliates to the Ala Story Print Collection.",1972.18,,,,,,,,,,,,,,,,,,,,,,,,,,,,,,,,,,,,,,,,,,,,,,,"Physical Object","<strong>The Ala Story Print Collection</strong>",1,0
"<strong>IONGHE</strong>, Clement","<em>Paralyticus Pertectum Demissus A Christo Sanatur</em>",n.d,"<strong>IONGHE</strong>, Clement","Gift of Walter Silva through the Art Affiliates to the Ala Story Print Collection",1971.52,,,,,,,,,,,,,,,,,,,,,,,,,,,,,,,,,,,,,,,,,,,,,,http://art-collections.museum.ucsb.edu/files/original/a321a003d7912f815a275b02f7cbd98f.jpg,"Physical Object","<strong>The Ala Story Print Collection</strong>",1,0
"<strong>IBELS</strong>, H. S. (After)",<em>Untitled</em>,1896-1900,"<strong>IBELS</strong>, H. S. (After)","Art Affilites to become part of the Ala Story Print Collection",1970.95,,,,,,,,,,,,,,,,,,,,,,,,,,,,,,,,,,,,,,,,,,,,,,http://art-collections.museum.ucsb.edu/files/original/fc044f04e5479a485c4339955230915b.jpg,"Physical Object","<strong>The Ala Story Print Collection</strong>",1,0
"<strong>HOUBRAKEN</strong>, Jacob","<em>Frederick, Duke of Schonberg</em>",1739,"<strong>HOUBRAKEN</strong>, Jacob","Gift of Ala Story to the Ala Story Print Collection",1967.38,,,,,,,,,,,,,,,,,,,,,,,,,,,,,,,,,,,,,,,,,,,,,,http://art-collections.museum.ucsb.edu/files/original/7edbc435ce7a027e83bb7c9ab662262d.jpg,"Physical Object","<strong>The Ala Story Print Collection</strong>",1,0
"<strong>HOUBRAKEN</strong>, Jacob","<em>Daniel, Earl of Nottingham</em>","18th C.","<strong>HOUBRAKEN</strong>, Jacob","Gift of Ala Story to the Ala Story Print Collection",1967.37,,,,,,,,,,,,,,,,,,,,,,,,,,,,,,,,,,,,,,,,,,,,,,http://art-collections.museum.ucsb.edu/files/original/bcd383009c8aaa0f9ec433710b4d988c.jpg,"Physical Object","<strong>The Ala Story Print Collection</strong>",1,0
"<strong>HOUBRAKEN</strong>, Jacob","<em>Algernon Percy, Earl of Northumberland</em>",1738,"<strong>HOUBRAKEN</strong>, Jacob","Gift of Ala Story to the Ala Story Print Collection",1967.35,,,,,,,,,,,,,,,,,,,,,,,,,,,,,,,,,,,,,,,,,,,,,,http://art-collections.museum.ucsb.edu/files/original/0663c6651b30c4f3dffb7bce814b2da2.jpg,"Physical Object","<strong>The Ala Story Print Collection</strong>",1,0
"<strong>HOPFER</strong>, Daniel; <strong>MANTEGNA</strong>, Andrea","<em>Battle of Hippocamps</em>","15th - 16th C.","<strong>HOPFER</strong>, Daniel; <strong>MANTEGNA</strong>, Andrea","Gift of Ala Story to the Ala Story Print Collection",1967.33,,,,,,,,,,,,,,,,,,,,,,,,,,,,,,,,,,,,,,,,,,,,,,http://art-collections.museum.ucsb.edu/files/original/dd4a50809919f2d8e473520f0b15688c.jpg,"Physical Object","<strong>The Ala Story Print Collection</strong>",1,0
"<strong>HOPFER</strong>, Daniel","<em>Christ Blessing the Virgin</em>","16th C.","<strong>HOPFER</strong>, Daniel","Ala Story Print Collection",1967.34,,,,,,,,,,,,,,,,,,,,,,,,,,,,,,,,,,,,,,,,,,,,,,http://art-collections.museum.ucsb.edu/files/original/cd3b214a854abbfb8afb0c5038a5c108.jpg,"Physical Object","<strong>The Ala Story Print Collection</strong>",1,0
"<strong>HOLLAR</strong>, Wenzel","<em>The Cathedral Church of Antwerp</em>",1649,"<strong>HOLLAR</strong>, Wenzel","Gift of Ala Story to the Ala Story Print Collection",1967.32,,,,,,,,,,,,,,,,,,,,,,,,,,,,,,,,,,,,,,,,,,,,,,http://art-collections.museum.ucsb.edu/files/original/e6aaf01b9f6f031cbc3858e70004bda4.jpg,"Physical Object","<strong>The Ala Story Print Collection</strong>",1,0
"<strong>HOLLAR</strong>, Wenzel","<em>Shepherd in Forest</em>","ca. 1641","<strong>HOLLAR</strong>, Wenzel","Gift of Ala Story to the Ala Story Print Collection",1967.31,,,,,,,,,,,,,,,,,,,,,,,,,,,,,,,,,,,,,,,,,,,,,,http://art-collections.museum.ucsb.edu/files/original/77f1ccde5fceb7545673644eca77f7b5.jpg,"Physical Object","<strong>The Ala Story Print Collection</strong>",1,0
"<strong>HOLLAR</strong>, Wenzel",<em>Winter</em>,1641,"<strong>HOLLAR</strong>, Wenzel","Gift of Ala Story to the Ala Story Print Collection",1967.3,,,,,,,,,,,,,,,,,,,,,,,,,,,,,,,,,,,,,,,,,,,,,,http://art-collections.museum.ucsb.edu/files/original/bc243089c6ed3b10dabf9d063b276f72.jpg,"Physical Object","<strong>The Ala Story Print Collection</strong>",1,0
"<strong>HOLLAR</strong>, Wenzel",<em>Autumn</em>,"ca. 1641","<strong>HOLLAR</strong>, Wenzel","Gift of Ala Story to the Ala Story Print Collection",1967.29,,,,,,,,,,,,,,,,,,,,,,,,,,,,,,,,,,,,,,,,,,,,,,http://art-collections.museum.ucsb.edu/files/original/8d714c5b133d4b763c52b71a49a7638e.jpg,"Physical Object","<strong>The Ala Story Print Collection</strong>",1,0
"<strong>HOLLAR</strong>, Wenzel",<em>Summer</em>,"ca. 1641","<strong>HOLLAR</strong>, Wenzel","Ala Story Print Collection",1967.28,,,,,,,,,,,,,,,,,,,,,,,,,,,,,,,,,,,,,,,,,,,,,,http://art-collections.museum.ucsb.edu/files/original/a74a80fc0394ebda7c30fc9b177a1317.jpg,"Physical Object","<strong>The Ala Story Print Collection</strong>",1,0
"<strong>HOLLAR</strong>, Wenzel",<em>Spring</em>,"ca. 1641","<strong>HOLLAR</strong>, Wenzel","Gift of Ala Story to the Ala Story Print Collection",1967.27,,,,,,,,,,,,,,,,,,,,,,,,,,,,,,,,,,,,,,,,,,,,,,http://art-collections.museum.ucsb.edu/files/original/60cb996cfab0fca8eeec695dceed0218.jpg,"Physical Object","<strong>The Ala Story Print Collection</strong>",1,0
"<strong>HADEN</strong>, Seymour","<em>The Little Boat House</em>",1877,"<strong>HADEN</strong>, Seymour","Ala Story Print Collection",1968.109,,,,,,,,,,,,,,,,,,,,,,,,,,,,,,,,,,,,,,,,,,,,,,http://art-collections.museum.ucsb.edu/files/original/5b28a0871e8a53987ff85fadf01de10b.jpg,"Physical Object","<strong>The Ala Story Print Collection</strong>",1,0
"<strong>GREUTER</strong>, Johann Friedrich","<em>Joannes Baptista Marinus</em>","17th C.","<strong>GREUTER</strong>, Johann Friedrich","Gift of Ala Story to the Ala Story Print Collection",1967.26,,,,,,,,,,,,,,,,,,,,,,,,,,,,,,,,,,,,,,,,,,,,,,http://art-collections.museum.ucsb.edu/files/original/ce37d42a6dcd7a818aa33a6c1558ba93.jpg,"Physical Object","<strong>The Ala Story Print Collection</strong>",1,0
"<strong>GOLTZIUS</strong>, Hendrick","<em>The Passion: The Last Supper</em>",1598,"<strong>GOLTZIUS</strong>, Hendrick","Gift of Ala Story to the Ala Story Print Collection",1967.25,,,,,,,,,,,,,,,,,,,,,,,,,,,,,,,,,,,,,,,,,,,,,,http://art-collections.museum.ucsb.edu/files/original/cce1fb9b4d36c242fd81f4eb27e4b19c.jpg,"Physical Object","<strong>The Ala Story Print Collection</strong>",1,0
"<strong>GILLOT</strong>, Claude","<em>Feast of Pan</em>","ca. 1707-1708","<strong>GILLOT</strong>, Claude","Ala Story Print Collection",1967.24,,,,,,,,,,,,,,,,,,,,,,,,,,,,,,,,,,,,,,,,,,,,,,http://art-collections.museum.ucsb.edu/files/original/6334bd1ced997c8ac49efa0083f9c5e0.jpg,"Physical Object","<strong>The Ala Story Print Collection</strong>",1,0
"<strong>GHISI</strong>, Giorgio","<em>Venus and Adonis</em>","ca. 1570","<strong>GHISI</strong>, Giorgio","Ala Story Print Collection",1967.23,,,,,,,,,,,,,,,,,,,,,,,,,,,,,,,,,,,,,,,,,,,,,,http://art-collections.museum.ucsb.edu/files/original/ce19152d8428b26b8990181c1bde35e0.jpg,"Physical Object","<strong>The Ala Story Print Collection</strong>",1,0
"<strong>FURST</strong>, Paul","<em>St. John the Baptist</em>","17th C","<strong>FURST</strong>, Paul","Ala Story Print Collection",1970.8,,,,,,,,,,,,,,,,,,,,,,,,,,,,,,,,,,,,,,,,,,,,,,http://art-collections.museum.ucsb.edu/files/original/fbbbf26e283d5eec4cfeb00d5835ab90.jpg,"Physical Object","<strong>The Ala Story Print Collection</strong>",1,0
"<strong>FREDERICK</strong>, Franck","<em>Hudson Fugue</em>","20th C.","<strong>FREDERICK</strong>, Franck","Anonymous gift to the Ala Story Print Collection",1971.4,,,,,,,,,,,,,,,,,,,,,,,,,,,,,,,,,,,,,,,,,,,,,,http://art-collections.museum.ucsb.edu/files/original/56276957d1f6bf6db0d6f682c35d5ae0.jpg,"Physical Object","<strong>The Ala Story Print Collection</strong>",1,0
"<strong>FLORSHEIM</strong>, Richard",<em>Seashore</em>,n.d,"<strong>FLORSHEIM</strong>, Richard","Anonymous gift to the Ala Story Print Collection",1971.1,,,,,,,,,,,,,,,,,,,,,,,,,,,,,,,,,,,,,,,,,,,,,,http://art-collections.museum.ucsb.edu/files/original/309e0be737f2ea91bad503f3db70cf8a.jpg,"Physical Object","<strong>The Ala Story Print Collection</strong>",1,0
"<strong>FANTIN-LATOUR</strong>, Henri","<em>Un Morceau de Schumann</em>",1864,"<strong>FANTIN-LATOUR</strong>, Henri","UCSB Art Affiliates Purchase Fund, to the Ala Story Print Collection",1970.102,,,,,,,,,,,,,,,,,,,,,,,,,,,,,,,,,,,,,,,,,,,,,,http://art-collections.museum.ucsb.edu/files/original/f3a8e6022cca1bfe6339d28cea3cc6f9.jpg,"Physical Object","<strong>The Ala Story Print Collection</strong>",1,0
"<strong>EGLAU</strong>, Otto","<em>Marine Landscape</em>",1960,"<strong>EGLAU</strong>, Otto","Anonymous gift to the Ala Story Print Collection",1968.5,,,,,,,,,,,,,,,,,,,,,,,,,,,,,,,,,,,,,,,,,,,,,,http://art-collections.museum.ucsb.edu/files/original/2617ab3eecaa94936eb8bd972c870854.jpg,"Physical Object","<strong>The Ala Story Print Collection</strong>",1,0
"<strong>EDMONDSON</strong>, Leonard",<em>Untitled</em>,1953,"<strong>EDMONDSON</strong>, Leonard","Ala Story Print Collection",1963.142,,,,,,,,,,,,,,,,,,,,,,,,,,,,,,,,,,,,,,,,,,,,,,http://art-collections.museum.ucsb.edu/files/original/aca80a1ca5dc1efb404d8162bd7faeb9.jpg,"Physical Object","<strong>The Ala Story Print Collection</strong>",1,0
"<strong>DURER</strong>, Albrecht","<em>Joachim's Offering Rejected by the High Priest</em>","ca. 1504","<strong>DURER</strong>, Albrecht","Gift of Ala Story to the Ala Story Print Collection",1967.22,,,,,,,,,,,,,,,,,,,,,,,,,,,,,,,,,,,,,,,,,,,,,,http://art-collections.museum.ucsb.edu/files/original/d39e3b7c6cf58f74d58add81247443c0.jpg,"Physical Object","<strong>The Ala Story Print Collection</strong>",1,0
"<strong>DURER</strong>, Albrecht","<em>Joachim's Offering Rejected by the High Priest</em>","ca. 1504","<strong>DURER</strong>, Albrecht","Gift of Ala Story to the Ala Story Print Collection",1967.22,,,,,,,,,,,,,,,,,,,,,,,,,,,,,,,,,,,,,,,,,,,,,,http://art-collections.museum.ucsb.edu/files/original/30feba2ef0ef43a7f33fbac4243e4b61.jpg,"Physical Object","<strong>The Ala Story Print Collection</strong>",1,0
"<strong>DINE</strong>, Jim","<em>The Heart Called ""Paris Spring""</em>",1982,"<strong>DINE</strong>, Jim","Gift of Miss Margaret Mallory to the Ala Story Print Collection",1984.37,,,,,,,,,,,,,,,,,,,,,,,,,,,,,,,,,,,,,,,,,,,,,,http://art-collections.museum.ucsb.edu/files/original/cb40634ed9ad388b64c7795decac1844.jpg,"Physical Object","<strong>The Ala Story Print Collection</strong>",1,0
"<strong>DENTE</strong>, Marco","<em>Venus Removing a Thorn</em>","late 15th C.","<strong>DENTE</strong>, Marco","Gift of Ala Story to the Ala Story Print Collection",1967.21,,,,,,,,,,,,,,,,,,,,,,,,,,,,,,,,,,,,,,,,,,,,,,http://art-collections.museum.ucsb.edu/files/original/cd9fe8c4edb83a1c7e1cad3654d18e3a.jpg,"Physical Object","<strong>The Ala Story Print Collection</strong>",1,0
"<strong>DELLA BELLA</strong>, Stefano","<em>Mount Parnassus</em>",1655,"<strong>DELLA BELLA</strong>, Stefano","Gift of Ala Story to the Ala Story Print Collection",1967.7,,,,,,,,,,,,,,,,,,,,,,,,,,,,,,,,,,,,,,,,,,,,,,http://art-collections.museum.ucsb.edu/files/original/b2e6e68e158da47a667513d0a3cfbf5d.jpg,"Physical Object","<strong>The Ala Story Print Collection</strong>",1,0
"<strong>CRANACH</strong>, Lucas","<em>Marcus Curtius</em>","ca. 1506-1507","<strong>CRANACH</strong>, Lucas","Gift of Ala Story to the Ala Story Print Collection",1967.2,,,,,,,,,,,,,,,,,,,,,,,,,,,,,,,,,,,,,,,,,,,,,,http://art-collections.museum.ucsb.edu/files/original/0ee90d4cfcd554c8868e71a705c5b2d0.jpg,"Physical Object","<strong>The Ala Story Print Collection</strong>",1,0
"<strong>CLODION</strong>, Claude-Michel (or his circle)",<em>Bacchanalia</em>,"18th-19th c.","<strong>CLODION</strong>, Claude-Michel (or his circle)","Ala Story Collection",1972.152,,,,,,,,,,,,,,,,,,,,,,,,,,,,,,,,,,,,,,,,,,,,,,http://art-collections.museum.ucsb.edu/files/original/628898a6995991e0cd5ed44b66d67ad1.jpg,"Physical Object","<strong>The Ala Story Print Collection</strong>",1,0
"<strong>CLAVE</strong>, ?",<em>untitled</em>,n.d,"<strong>CLAVE</strong>, ?","Ala Story Print Collection",1973.161,,,,,,,,,,,,,,,,,,,,,,,,,,,,,,,,,,,,,,,,,,,,,,,"Physical Object","<strong>The Ala Story Print Collection</strong>",1,0
"<strong>CHERET</strong>, Jules (After)","<em>Exposition de l'Art Francais</em>",1888,"<strong>CHERET</strong>, Jules (After)","Art Affiliates, to become part of the Ala Story Print Collection",1970.96,,,,,,,,,,,,,,,,,,,,,,,,,,,,,,,,,,,,,,,,,,,,,,http://art-collections.museum.ucsb.edu/files/original/6accecead8053e6690a19fb9c53d8cef.jpg,"Physical Object","<strong>The Ala Story Print Collection</strong>",1,0
"<strong>CASTIGLIONE</strong>, Giovanni Benedetto","<em>Diogenes (Among the Ruins)</em>","17th C","<strong>CASTIGLIONE</strong>, Giovanni Benedetto","Gift of Ala Story to the Ala Story Print Collection",1967.19,,,,,,,,,,,,,,,,,,,,,,,,,,,,,,,,,,,,,,,,,,,,,,http://art-collections.museum.ucsb.edu/files/original/8300d346a1b1b8f6e59997c6e33c9ba1.jpg,"Physical Object","<strong>The Ala Story Print Collection</strong>",1,0
"<strong>CASTELLON</strong>, Federico","<em>Poseidon's Friend</em>",n.d.,"<strong>CASTELLON</strong>, Federico","Anonymous gift to the Ala Story Print Collection",1969.55,,,,,,,,,,,,,,,,,,,,,,,,,,,,,,,,,,,,,,,,,,,,,,,"Physical Object","<strong>The Ala Story Print Collection</strong>",1,0
"<strong>CASSANDRE</strong>, A. M.",<em>Greece</em>,1922,"<strong>CASSANDRE</strong>, A. M.","Art Affiliates Ala Story Print Collection",1970.39,,,,,,,,,,,,,,,,,,,,,,,,,,,,,,,,,,,,,,,,,,,,,,,"Physical Object","<strong>The Ala Story Print Collection</strong>",1,0
"<strong>CARRIERE</strong>, Eugene","<em>Buste de Jeune Fille</em>",1890,"<strong>CARRIERE</strong>, Eugene","Art Affiliates Purchase Fund for the Ala Story Print Collection",1970.38,,,,,,,,,,,,,,,,,,,,,,,,,,,,,,,,,,,,,,,,,,,,,,http://art-collections.museum.ucsb.edu/files/original/8d792b0b67c72c9a1583f4cd29dd55ae.jpg,"Physical Object","<strong>The Ala Story Print Collection</strong>",1,0
"<strong>CARRACCI</strong>, Agostino","<em>Nymph and Satyr</em>","late 16th C.","<strong>CARRACCI</strong>, Agostino","Gift of Ala Story to the Ala Story Print Collection",1967.18,,,,,,,,,,,,,,,,,,,,,,,,,,,,,,,,,,,,,,,,,,,,,,,"Physical Object","<strong>The Ala Story Print Collection</strong>",1,0
"<strong>CARQUEVILLE</strong>, Will","<em>Lippincott's May, 1895</em>","19th C.","<strong>CARQUEVILLE</strong>, Will","Art Affiliates, to become part of the Ala Story Print Collection",1970.94,,,,,,,,,,,,,,,,,,,,,,,,,,,,,,,,,,,,,,,,,,,,,,http://art-collections.museum.ucsb.edu/files/original/2c7ab185b0bc907f69b55f848af2d487.jpg,"Physical Object","<strong>The Ala Story Print Collection</strong>",1,0
"<strong>CANTU</strong>, Federico","<em>Head with Angel Musician</em>",1959,"<strong>CANTU</strong>, Federico","Ala Story Collection",1963.140,,,,,,,,,,,,,,,,,,,,,,,,,,,,,,,,,,,,,,,,,,,,,,http://art-collections.museum.ucsb.edu/files/original/7c046ce49c9019027f6261a45352f1ba.jpg,"Physical Object","<strong>The Ala Story Print Collection</strong>",1,0
"<strong>CANTARINI</strong>, Simone","<em>Rest on the Flight to Egypt</em>","early 17th C.","<strong>CANTARINI</strong>, Simone","Gift of Ala Story to the Ala Story Print Collection",1967.17,,,,,,,,,,,,,,,,,,,,,,,,,,,,,,,,,,,,,,,,,,,,,,http://art-collections.museum.ucsb.edu/files/original/0432a76905faaec87c34faa84bb1f296.jpg,"Physical Object","<strong>The Ala Story Print Collection</strong>",1,0
"<strong>CAMERON</strong>, David Young",<em>Tweedside</em>,"19th - 20th C.","<strong>CAMERON</strong>, David Young","Gift of Frances Holden through the Art Affiliates to the Ala Story Print Collection",1971.143,,,,,,,,,,,,,,,,,,,,,,,,,,,,,,,,,,,,,,,,,,,,,,http://art-collections.museum.ucsb.edu/files/original/b4fe7c8a136f160d5751f928cf697114.jpg,"Physical Object","<strong>The Ala Story Print Collection</strong>",1,0
"<strong>CAMERON</strong>, David Young",<em>Tweedside</em>,"19th - 20th C.","<strong>CAMERON</strong>, David Young","Gift of Frances Holden through the Art Affiliates to the Ala Story Print Collection",1971.143,,,,,,,,,,,,,,,,,,,,,,,,,,,,,,,,,,,,,,,,,,,,,,http://art-collections.museum.ucsb.edu/files/original/430bfb92fb6416c36728faaaead6351e.jpg,"Physical Object","<strong>The Ala Story Print Collection</strong>",1,0
"<strong>CALLOT</strong>, Jacques","<em>Saint Amond Preaching</em>","17th C.","<strong>CALLOT</strong>, Jacques","Gift of Ala Story to the Ala Story Print Collection",1967.16,,,,,,,,,,,,,,,,,,,,,,,,,,,,,,,,,,,,,,,,,,,,,,http://art-collections.museum.ucsb.edu/files/original/83d381e79616d8c8ea8761dee21bed1c.jpg,"Physical Object","<strong>The Ala Story Print Collection</strong>",1,0
"<strong>BURGKMAIR</strong>, Hans","<em>Two Reindeer</em>","ca. 1508 - 1519","<strong>BURGKMAIR</strong>, Hans","Ala Storey",1964.150,,,,,,,,,,,,,,,,,,,,,,,,,,,,,,,,,,,,,,,,,,,,,,,"Physical Object","<strong>The Ala Story Print Collection</strong>",1,0
"<strong>BURGKMAIR</strong>, Hans","<em>Five Knights in Armor</em>","ca. 1508-1519","<strong>BURGKMAIR</strong>, Hans","Gift of Ala Story to the Ala Story Print Collection",1967.14,,,,,,,,,,,,,,,,,,,,,,,,,,,,,,,,,,,,,,,,,,,,,,http://art-collections.museum.ucsb.edu/files/original/710e6d28012e3635157a909ac1c0557a.jpg,"Physical Object","<strong>The Ala Story Print Collection</strong>",1,0
"<strong>BURGKMAIR</strong>, Hans","<em>Car of Jesters and Fools</em>","ca 1508-1519","<strong>BURGKMAIR</strong>, Hans","Gift of Ala Story to the Ala Story Print Collection",1967.13,,,,,,,,,,,,,,,,,,,,,,,,,,,,,,,,,,,,,,,,,,,,,,http://art-collections.museum.ucsb.edu/files/original/5d20b70a3f743c42009b272ede015e89.jpg,"Physical Object","<strong>The Ala Story Print Collection</strong>",1,0
"<strong>BURGKMAIR</strong>, Hans","<em>The Chief Boar Hunter</em>",n.d.,"<strong>BURGKMAIR</strong>, Hans","Gift of Ala Story to the Ala Story Print Collection",1967.12,,,,,,,,,,,,,,,,,,,,,,,,,,,,,,,,,,,,,,,,,,,,,,,"Physical Object","<strong>The Ala Story Print Collection</strong>",1,0
"<strong>BURGKMAIR</strong>, Hans","<em>The Master Falconer</em>","ca 1508-1519","<strong>BURGKMAIR</strong>, Hans","Gift of Ala Story to the Ala Story Print Collection",1967.11,,,,,,,,,,,,,,,,,,,,,,,,,,,,,,,,,,,,,,,,,,,,,,http://art-collections.museum.ucsb.edu/files/original/923a9a04f9be68cdde9df26d0cb32e67.jpg,"Physical Object","<strong>The Ala Story Print Collection</strong>",1,0
"<strong>BROWN</strong>, Ray","<em>Mountain and Occupied Bedroom</em>",n.d,"<strong>BROWN</strong>, Ray","Gift of Dr. and Mrs. Eugene Anderson through the Art Affiliates to the Ala Story Print Collection.",1972.2,,,,,,,,,,,,,,,,,,,,,,,,,,,,,,,,,,,,,,,,,,,,,,,"Physical Object","<strong>The Ala Story Print Collection</strong>",1,0
"<strong>BRODERSON</strong>, Morris","<em>Interior with Figures</em>",1953,"<strong>BRODERSON</strong>, Morris","Gift of Miss Margaret Mallory to the Ala Story Print Collection",1982.13,,,,,,,,,,,,,,,,,,,,,,,,,,,,,,,,,,,,,,,,,,,,,,,"Physical Object","<strong>The Ala Story Print Collection</strong>",1,0
"<strong>BOYD</strong>, Arthur","<em>The Giving of the Sheep</em>",1960's,"<strong>BOYD</strong>, Arthur","Ala Story Print Collection",1968.13,,,,,,,,,,,,,,,,,,,,,,,,,,,,,,,,,,,,,,,,,,,,,,http://art-collections.museum.ucsb.edu/files/original/a62a123774961dd82aef94fbb507031a.jpg,"Physical Object","<strong>The Ala Story Print Collection</strong>",1,0
"<strong>BOTH</strong>, Jan","<em>Landscape with Travelers</em>","17th C.","<strong>BOTH</strong>, Jan","Gift of Ala Story to the Ala Story Print Collection",1967.1,,,,,,,,,,,,,,,,,,,,,,,,,,,,,,,,,,,,,,,,,,,,,,http://art-collections.museum.ucsb.edu/files/original/3ef966780a96e926bdb3bd102a27d5e0.jpg,"Physical Object","<strong>The Ala Story Print Collection</strong>",1,0