﻿"Dublin Core:Title","Dublin Core:Description","Dublin Core:Date","Dublin Core:Creator","Dublin Core:Source","Dublin Core:Identifier","Dublin Core:Contributor","Dublin Core:Rights","Dublin Core:Relation","Dublin Core:Format","Dublin Core:Language","Dublin Core:Type","Dublin Core:Coverage","Dublin Core:Subject","Dublin Core:Publisher","Item Type Metadata:Birth Date","Item Type Metadata:Birthplace","Item Type Metadata:Event Type","Item Type Metadata:Participants","Item Type Metadata:URL","Item Type Metadata:Death Date","Item Type Metadata:Occupation","Item Type Metadata:Biographical Text","Item Type Metadata:Bibliography","Item Type Metadata:File name","Item Type Metadata:Time Summary","Item Type Metadata:Interviewer","Item Type Metadata:Interviewee","Item Type Metadata:Location","Item Type Metadata:Transcription","Item Type Metadata:Local URL","Item Type Metadata:Original Format","Item Type Metadata:Physical Dimensions","Item Type Metadata:Duration","Item Type Metadata:Compression","Item Type Metadata:Producer","Item Type Metadata:Director","Item Type Metadata:Bit Rate/Frequency","Item Type Metadata:Text","Item Type Metadata:Email Body","Item Type Metadata:Subject Line","Item Type Metadata:From","Item Type Metadata:To","Item Type Metadata:CC","Item Type Metadata:BCC","Item Type Metadata:Number of Attachments","Item Type Metadata:Standards","Item Type Metadata:Objectives","Item Type Metadata:Materials","Item Type Metadata:Tags",tags,file,itemType,collection,public,featured
<strong>ISLAMIC</strong>,"<em>Necklace - disassembled</em>",n.d.,,"Gift of Frances Holden",1988.347,,,,,,,,,,,,,,,,,,,,,,,,,,,,,,,,,,,,,,,,,,,,,"Beads,necklace,Sculpture,still life,stone",http://art-collections.museum.ucsb.edu/files/original/267670647178f188b350f56b81f06cc0.jpg,,"<strong>The Arts of the Middle East </strong>",1,0
"<strong>ISLAMIC</strong>, Iran",<em>Beaker</em>,"12th -13th C.",,"Grace Dreyfus Collection",1981.127,,,,,,,,,,,,,,,,,,,,,,,,,,,,,,,,,,,,,,,,,,,,,"beaker,ceramic,geometric,Iran,Sculpture,still life,vessel",http://art-collections.museum.ucsb.edu/files/original/8910e39d98acbfb8bec67fe4432cccc6.jpg,,"<strong>The Arts of the Middle East </strong>",1,0
<strong>ISLAMIC</strong>,<em>Vase</em>,n.d.,,"Grace Dreyfus Collection",1981.126,,,,,,,,,,,,,,,,,,,,,,,,,,,,,,,,,,,,,,,,,,,,,,,,"<strong>The Arts of the Middle East </strong>",1,0
<strong>ISLAMIC</strong>,<em>Vase</em>,"18th C.",Turkestan,,1968.87,,,,,,,,,,,,,,,,,,,,,,,,,,,,,,,,,,,,,,,,,,,,,"Blue,floral,glaze,gray,Sculpture,still life,Turkestan,vase",http://art-collections.museum.ucsb.edu/files/original/137264dec488897721423f185012c944.jpg,,"<strong>The Arts of the Middle East </strong>",1,0
"<strong>ISLAMIC</strong>, Iran, Amlash",<em>Beaker</em>,"1200-800 BCE",Persian,"Gift of Mr. and Mrs. Leon Wolcott",1971.156,,,,,,,,,,,,,,,,,,,,,,,,,,,,,,,,,,,,,,,,,,,,,"beaker,clay,Iran,red,Sculpture,still life",http://art-collections.museum.ucsb.edu/files/original/52986a215ec1fd1646dbf525c9c7505a.jpg,,"<strong>The Arts of the Middle East </strong>",1,0
"<strong>ISLAMIC</strong>, Iran, Amlash","<em>Deep bowl</em>","1200-800 BCE",Persian,"Gift of Mr. and Mrs. Leon Wolcott",1971.151,,,,,,,,,,,,,,,,,,,,,,,,,,,,,,,,,,,,,,,,,,,,,"bowl,clay,Iran,Sculpture,still life",http://art-collections.museum.ucsb.edu/files/original/b10dd6539034d515ec70b300bf7c9dbb.jpg,,"<strong>The Arts of the Middle East </strong>",1,0
<strong>ISLAMIC</strong>,<em>Bowl</em>,n.d.,"Middle East","Grace H. Dreyfus Collection",1983.5,,,,,,,,,,,,,,,,,,,,,,,,,,,,,,,,,,,,,,,,,,,,,"bowl,Bronze,Islamic,Sculpture,still life",http://art-collections.museum.ucsb.edu/files/original/370f2c74fc03238aa37e19ea783cbd47.jpg,,"<strong>The Arts of the Middle East </strong>",1,0
<strong>ISLAMIC</strong>,"<em>Tear Bottle</em>","ca. 9-10th century C.E.","Middle East","Grace H. Dreyfus Collection",1971.77.5,,,,,,,,,,,,,,,,,,,,,,,,,,,,,,,,,,,,,,,,,,,,,"bottle,glass,green,Sculpture,still life",http://art-collections.museum.ucsb.edu/files/original/9a32349698634e78091718ea2c2d6a94.jpg,,"<strong>The Arts of the Middle East </strong>",1,0
<strong>ISLAMIC</strong>,"<em>Tear Bottle</em>","ca. 9-10th century C.E.","Middle East","Grace H. Dreyfus Collection",1971.77.4,,,,,,,,,,,,,,,,,,,,,,,,,,,,,,,,,,,,,,,,,,,,,"bottle,glass,Islamic,Sculpture,still life",http://art-collections.museum.ucsb.edu/files/original/3a548f4fe679b70bb1f2645789bb6ad2.jpg,,"<strong>The Arts of the Middle East </strong>",1,0
<strong>ISLAMIC</strong>,"<em>Tear Bottle</em>","ca. 9-10th century C.E.","Middle East","Grace H. Dreyfus Collection",1971.77.3,,,,,,,,,,,,,,,,,,,,,,,,,,,,,,,,,,,,,,,,,,,,,"bottle,brown,glass,Islamic,Sculpture,still life",http://art-collections.museum.ucsb.edu/files/original/f3f5251d8a4650d0a5ff3a53e9308674.jpg,,"<strong>The Arts of the Middle East </strong>",1,0
<strong>ISLAMIC</strong>,"<em>Tear Bottle</em>","ca. 9-10th century C.E.","Middle East","Grace H. Dreyfus Collection",1971.77.2,,,,,,,,,,,,,,,,,,,,,,,,,,,,,,,,,,,,,,,,,,,,,"bottle,glass,green,Sculpture,still life",http://art-collections.museum.ucsb.edu/files/original/f06f9d1ec0beeb94897fbe9cc4e7bc5a.jpg,,"<strong>The Arts of the Middle East </strong>",1,0
<strong>ISLAMIC</strong>,"<em>Tear Bottle</em>","ca. 9-10th century C.E.","Middle East","Grace H. Dreyfus Collection",1971.77.1,,,,,,,,,,,,,,,,,,,,,,,,,,,,,,,,,,,,,,,,,,,,,"bottle,glass,Islamic,Sculpture,still life",http://art-collections.museum.ucsb.edu/files/original/8a17f0f97ab9cd6583b0827aa53e6be5.jpg,,"<strong>The Arts of the Middle East </strong>",1,0
"<strong>LURISTAN</strong>, Iran","<em>Axe Head</em>",n.d.,"Luristan, Iran","Grace H. Dreyfus Collection",1971.7,,,,,,,,,,,,,,,,,,,,,,,,,,,,,,,,,,,,,,,,,,,,,"Axe,Bronze,Iran,Luristan,Sculpture,still life",http://art-collections.museum.ucsb.edu/files/original/c2170107b69f99b096922845b1b9b713.jpg,"Physical Object","<strong>The Arts of the Middle East </strong>",1,0
<strong>LURISTAN</strong>,"<em>Seated Fawn</em>","ca. 1200-800 B.C.",Luristan,"Grace H. Dreyfus Collection",1981.86,,,,,,,,,,,,,,,,,,,,,,,,,,,,,,,,,,,,,,,,,,,,,"animal,Bronze,fawn,Luristan,Sculpture,still life",http://art-collections.museum.ucsb.edu/files/original/eabff63a7e94d0cdd2e2932e724365ec.jpg,"Physical Object","<strong>The Arts of the Middle East </strong>",1,0
<strong>LURISTAN</strong>,<em>Ibix</em>,"ca. 1200-800 B.C.",Luristan,"Grace H. Dreyfus Collection",1981.85,,,,,,,,,,,,,,,,,,,,,,,,,,,,,,,,,,,,,,,,,,,,,,,"Physical Object","<strong>The Arts of the Middle East </strong>",1,0
<strong>LURISTAN</strong>,<em>Ibix</em>,"ca. 1200-800 B.C.",Luristan,"Grace H. Dreyfus Collection",1981.84,,,,,,,,,,,,,,,,,,,,,,,,,,,,,,,,,,,,,,,,,,,,,"animal,Bronze,ibex,Luristan,Sculpture,still life",http://art-collections.museum.ucsb.edu/files/original/672e3b7e6c30041e43582561f3e3ca41.jpg,"Physical Object","<strong>The Arts of the Middle East </strong>",1,0
<strong>LURISTAN</strong>,"<em>Luristan Bronze Arrowhead</em>","ca. 1200-800 B.C.",Luristan,,1981.21.k,,,,,,,,,,,,,,,,,,,,,,,,,,,,,,,,,,,,,,,,,,,,,"arrowhead,Bronze,Luristan,Sculpture,still life",http://art-collections.museum.ucsb.edu/files/original/3619fba79b4011d7b2c726ca7c3081eb.jpg,"Physical Object","<strong>The Arts of the Middle East </strong>",1,0
<strong>LURISTAN</strong>,"<em>Luristan Bronze Arrowhead</em>","ca. 1200-800 B.C.",Luristan,,1981.21.j,,,,,,,,,,,,,,,,,,,,,,,,,,,,,,,,,,,,,,,,,,,,,,,"Physical Object","<strong>The Arts of the Middle East </strong>",1,0
<strong>LURISTAN</strong>,"<em>Luristan Bronze Arrowhead</em>","ca. 1200-800 B.C.",Luristan,,1981.21.i,,,,,,,,,,,,,,,,,,,,,,,,,,,,,,,,,,,,,,,,,,,,,"arrowhead,Bronze,Luristan,Sculpture,still life",http://art-collections.museum.ucsb.edu/files/original/eb3fa99407a20a8afa68f8222007932c.jpg,"Physical Object","<strong>The Arts of the Middle East </strong>",1,0
<strong>LURISTAN</strong>,"<em>Luristan Bronze Arrowhead</em>","ca. 1200-800 B.C.",Luristan,,1981.21.h,,,,,,,,,,,,,,,,,,,,,,,,,,,,,,,,,,,,,,,,,,,,,"arrowhead,Bronze,Luristan,Sculpture,still life",http://art-collections.museum.ucsb.edu/files/original/83fd671a932647b15f9e3d9984e42686.jpg,"Physical Object","<strong>The Arts of the Middle East </strong>",1,0
<strong>LURISTAN</strong>,"<em>Luristan Bronze Arrowhead</em>","ca. 1200-800 B.C.",Luristan,,1981.21.g,,,,,,,,,,,,,,,,,,,,,,,,,,,,,,,,,,,,,,,,,,,,,,,"Physical Object","<strong>The Arts of the Middle East </strong>",1,0
<strong>LURISTAN</strong>,"<em>Luristan Bronze Arrowhead</em>","ca. 1200-800 B.C.",Luristan,,1981.21.f,,,,,,,,,,,,,,,,,,,,,,,,,,,,,,,,,,,,,,,,,,,,,"arrowhead,Bronze,Luristan,Sculpture,still life",http://art-collections.museum.ucsb.edu/files/original/35d4b4f253f32f609b1a6f1c27cf7ea5.jpg,"Physical Object","<strong>The Arts of the Middle East </strong>",1,0
<strong>LURISTAN</strong>,"<em>Luristan Bronze Arrowhead</em>","ca. 1200-800 B.C.",Luristan,,1981.21.e,,,,,,,,,,,,,,,,,,,,,,,,,,,,,,,,,,,,,,,,,,,,,"arrowhead,Bronze,Luristan,Sculpture,still life",http://art-collections.museum.ucsb.edu/files/original/679967c138a991dacd7f762e4267f38f.jpg,"Physical Object","<strong>The Arts of the Middle East </strong>",1,0
<strong>LURISTAN</strong>,"<em>Luristan Bronze Arrowhead</em>","ca. 1200-800 B.C.",Luristan,,1981.21.d,,,,,,,,,,,,,,,,,,,,,,,,,,,,,,,,,,,,,,,,,,,,,"arrowhead,Bronze,Luristan,Sculpture,still life",http://art-collections.museum.ucsb.edu/files/original/b93724fb889c8313387b67a3fc0f28d8.jpg,"Physical Object","<strong>The Arts of the Middle East </strong>",1,0
<strong>LURISTAN</strong>,"<em>Luristan Bronze Arrowhead</em>","ca. 1200-800 B.C.",Luristan,,1981.21.c,,,,,,,,,,,,,,,,,,,,,,,,,,,,,,,,,,,,,,,,,,,,,,,"Physical Object","<strong>The Arts of the Middle East </strong>",1,0
<strong>LURISTAN</strong>,"<em>Luristan Bronze Arrowhead</em>","ca. 1200-800 B.C.",Luristan,,1981.21.b,,,,,,,,,,,,,,,,,,,,,,,,,,,,,,,,,,,,,,,,,,,,,,,"Physical Object","<strong>The Arts of the Middle East </strong>",1,0
<strong>LURISTAN</strong>,<em>Arrowhead</em>,"ca. 1200-800 B.C.",Luristan,,1981.21.a,,,,,,,,,,,,,,,,,,,,,,,,,,,,,,,,,,,,,,,,,,,,,"arrowhead,Bronze,Luristan,Sculpture,still life",http://art-collections.museum.ucsb.edu/files/original/374afe8a4c36829045f7c9c91fa8f2d0.jpg,"Physical Object","<strong>The Arts of the Middle East </strong>",1,0
<strong>LURISTAN</strong>,<em>Bracelet</em>,n.d.,LURISTAN,"Gift of Mrs. Louis Dreyfus",1971.72,,,,,,,,,,,,,,,,,,,,,,,,,,,,,,,,,,,,,,,,,,,,,"Bracelet,Bronze,Jewelry,Luristan,Sculpture,snake,still life",http://art-collections.museum.ucsb.edu/files/original/45d6f2b2cb76be250ee9ad84f89ce60e.jpg,"Physical Object","<strong>The Arts of the Middle East </strong>",1,0
<strong>LURISTAN</strong>,"<em>Staff Acroterium</em>",n.d.,Luristan,"Gift of Grace H. Dreyfus",1971.71,,,,,,,,,,,,,,,,,,,,,,,,,,,,,,,,,,,,,,,,,,,,,"Bronze,Luristan,Sculpture,staff,still life",http://art-collections.museum.ucsb.edu/files/original/25e456307126631d328b6340fe0f6e68.jpg,"Physical Object","<strong>The Arts of the Middle East </strong>",1,0
<strong>LURISTAN</strong>,<em>Deer</em>,n.d.,LURISTAN,"Gift of Mrs. Louis Dreyfus",1971.69.3,,,,,,,,,,,,,,,,,,,,,,,,,,,,,,,,,,,,,,,,,,,,,"Bronze,deer,figurine,Luristan,Sculpture,still life",http://art-collections.museum.ucsb.edu/files/original/af19ee172a09b3c8b7adba486a5048e2.jpg,"Physical Object","<strong>The Arts of the Middle East </strong>",1,0
<strong>LURISTAN</strong>,<em>Deer</em>,n.d.,LURISTAN,"Gift of Mrs. Louis Dreyfus",1971.69.2,,,,,,,,,,,,,,,,,,,,,,,,,,,,,,,,,,,,,,,,,,,,,"Bronze,deer,figurine,Luristan,Sculpture,still life",http://art-collections.museum.ucsb.edu/files/original/f50ade535be2616568e137d710ccf48b.jpg,"Physical Object","<strong>The Arts of the Middle East </strong>",1,0
<strong>LURISTAN</strong>,<em>Deer</em>,n.d.,LURISTAN,"Gift of Mrs. Louis Dreyfus",1971.69.1,,,,,,,,,,,,,,,,,,,,,,,,,,,,,,,,,,,,,,,,,,,,,"Bronze,deer,figurine,Luristan,Sculpture,still life",http://art-collections.museum.ucsb.edu/files/original/3d86df861899648979a80e1ce2ccbd1f.jpg,"Physical Object","<strong>The Arts of the Middle East </strong>",1,0
<strong>LURISTAN</strong>,<em>Dagger</em>,n.d.,Luristan,"Grace H. Dreyfus Collection",1971.65,,,,,,,,,,,,,,,,,,,,,,,,,,,,,,,,,,,,,,,,,,,,,"Bronze,dagger,Luristan,Sculpture,still life",http://art-collections.museum.ucsb.edu/files/original/60f1331939b82ea838ada1ab579441cf.jpg,"Physical Object","<strong>The Arts of the Middle East </strong>",1,0
<strong>LURISTAN</strong>,"<em>Dagger Blade</em>","ca. 1200-800 B.C.",Luristan,"Grace H. Dreyfus Collection",1968.49,,,,,,,,,,,,,,,,,,,,,,,,,,,,,,,,,,,,,,,,,,,,,"blade,Bronze,dagger,Luristan,Sculpture,still life",http://art-collections.museum.ucsb.edu/files/original/31cfbcae6347a2e765a2d7c2bb0d63bd.jpg,"Physical Object","<strong>The Arts of the Middle East </strong>",1,0
<strong>LURISTAN</strong>,"<em>Weapon Blade</em>","ca. 1200-800 B.C.",Luristan,"Grace H. Dreyfus Collection",1968.48,,,,,,,,,,,,,,,,,,,,,,,,,,,,,,,,,,,,,,,,,,,,,"blade,Bronze,Luristan,Sculpture,still life,weapon",http://art-collections.museum.ucsb.edu/files/original/3550bab64a153fcebcf52f8858a6ee2d.jpg,"Physical Object","<strong>The Arts of the Middle East </strong>",1,0
<strong>LURISTAN</strong>,<em>Pot</em>,"ca. 1200-800 B.C.",Luristan,"Grace H. Dreyfus Collection",1968.47.2,,,,,,,,,,,,,,,,,,,,,,,,,,,,,,,,,,,,,,,,,,,,,"Bronze,Luristan,pot,Sculpture,still life",http://art-collections.museum.ucsb.edu/files/original/f2299e049ff69d5273e09fa93740b637.jpg,"Physical Object","<strong>The Arts of the Middle East </strong>",1,0
<strong>LURISTAN</strong>,<em>Pot</em>,"ca. 1200-800 B.C.",Luristan,"Grace H. Dreyfus Collection",1968.47.1,,,,,,,,,,,,,,,,,,,,,,,,,,,,,,,,,,,,,,,,,,,,,"Bronze,Luristan,pot,Sculpture,still life",http://art-collections.museum.ucsb.edu/files/original/83e9ee8f7a18b421ffacc726ed5680a0.jpg,"Physical Object","<strong>The Arts of the Middle East </strong>",1,0
<strong>LURISTAN</strong>,<em>Pot</em>,"ca. 1200-800 B.C.",Luristan,"Grace H. Dreyfus Collection",1968.46,,,,,,,,,,,,,,,,,,,,,,,,,,,,,,,,,,,,,,,,,,,,,"Bronze,Luristan,pot,Sculpture,still life",http://art-collections.museum.ucsb.edu/files/original/746e8177b87108e8a45850dc6f86810b.jpg,"Physical Object","<strong>The Arts of the Middle East </strong>",1,0
<strong>LURISTAN</strong>,<em>Bowl</em>,"ca. 1200-800 B.C.",Luristan,"Grace H. Dreyfus Collection",1968.45,,,,,,,,,,,,,,,,,,,,,,,,,,,,,,,,,,,,,,,,,,,,,"bowl,Bronze,Luristan,Sculpture,still life",http://art-collections.museum.ucsb.edu/files/original/f61e4be87f5e13a11d082082c9279fbf.jpg,"Physical Object","<strong>The Arts of the Middle East </strong>",1,0
<strong>LURISTAN</strong>,"<em>Horse Bit</em>","ca. 1200-800 B.C.",Luristan,"Grace H. Dreyfus Collection",1968.44,,,,,,,,,,,,,,,,,,,,,,,,,,,,,,,,,,,,,,,,,,,,,"Bronze,horse,Luristan,Sculpture,still life",http://art-collections.museum.ucsb.edu/files/original/3315a4513f49f3c1e10ed21f5de8e97a.jpg,"Physical Object","<strong>The Arts of the Middle East </strong>",1,0
<strong>LURISTAN</strong>,"<em>Bridle Bit Piece</em>","ca. 1200-800 B.C.",Luristan,"Grace H. Dreyfus Collection",1968.43,,,,,,,,,,,,,,,,,,,,,,,,,,,,,,,,,,,,,,,,,,,,,"bridle,Bronze,Luristan,Sculpture,still life",http://art-collections.museum.ucsb.edu/files/original/e212d543771eb1294a2af1a11d0bd24d.jpg,"Physical Object","<strong>The Arts of the Middle East </strong>",1,0
<strong>LURISTAN</strong>,<em>Ibex</em>,"ca. 1200-800 B.C.",Luristan,"Grace H. Dreyfus Collection",1968.42,,,,,,,,,,,,,,,,,,,,,,,,,,,,,,,,,,,,,,,,,,,,,"bridle,Bronze,ibex,Luristan,portrait,Sculpture",http://art-collections.museum.ucsb.edu/files/original/4d809195989325565f0b79c19853627e.jpg,"Physical Object","<strong>The Arts of the Middle East </strong>",1,0
<strong>LURISTAN</strong>,"<em>Mace Head</em>","ca. 1200-800 B.C.",Luristan,"Grace H. Dreyfus Collection",1968.41,,,,,,,,,,,,,,,,,,,,,,,,,,,,,,,,,,,,,,,,,,,,,"Bronze,Luristan,mace,Sculpture,still life",http://art-collections.museum.ucsb.edu/files/original/0efd0bd156634b1982772d232e54c972.jpg,"Physical Object","<strong>The Arts of the Middle East </strong>",1,0
<strong>LURISTAN</strong>,"<em>Mace Head</em>","ca. 1200-800 B.C.",Luristan,"Grace H. Dreyfus Collection",1968.40,,,,,,,,,,,,,,,,,,,,,,,,,,,,,,,,,,,,,,,,,,,,,"Bronze,Luristan,mace,Sculpture,still life",http://art-collections.museum.ucsb.edu/files/original/057e1492158c11b45b4609b7f06fa097.jpg,"Physical Object","<strong>The Arts of the Middle East </strong>",1,0
<strong>LURISTAN</strong>,<em>Dagger</em>,"ca. 1200-800 B.C.",Luristan,"Grace H. Dreyfus Collection",1968.39,,,,,,,,,,,,,,,,,,,,,,,,,,,,,,,,,,,,,,,,,,,,,"Bronze,dagger,Luristan,Sculpture,still life",http://art-collections.museum.ucsb.edu/files/original/762cfcd6119f6a190c039c3032ac79a2.jpg,"Physical Object","<strong>The Arts of the Middle East </strong>",1,0
<strong>LURISTAN</strong>,"<em>Axe Head</em>","ca. 1200-800 B.C.",Luristan,"Grace H. Dreyfus Collection",1968.38,,,,,,,,,,,,,,,,,,,,,,,,,,,,,,,,,,,,,,,,,,,,,"Axe,Bronze,Luristan,Sculpture,still life",http://art-collections.museum.ucsb.edu/files/original/0c5732d31017d2c218cde339deb7d581.jpg,"Physical Object","<strong>The Arts of the Middle East </strong>",1,0
<strong>LURISTAN</strong>,"<em>Axe Head</em>","ca. 1200-800 B.C.",Luristan,"Grace H. Dreyfus Collection",1968.37,,,,,,,,,,,,,,,,,,,,,,,,,,,,,,,,,,,,,,,,,,,,,"Axe,Bronze,Luristan,Sculpture,still life",http://art-collections.museum.ucsb.edu/files/original/20bccf47f028cc5bba9e28bb30535b14.jpg,"Physical Object","<strong>The Arts of the Middle East </strong>",1,0
<strong>LURISTAN</strong>,"<em>Axe Head</em>","ca. 1200-800 B.C.",Luristan,"Grace H. Dreyfus Collection",1968.36,,,,,,,,,,,,,,,,,,,,,,,,,,,,,,,,,,,,,,,,,,,,,"Axe,Bronze,Luristan,Sculpture,still life",http://art-collections.museum.ucsb.edu/files/original/b5fed065992098bb91bfe59e5d7bbbe5.jpg,"Physical Object","<strong>The Arts of the Middle East </strong>",1,0
<strong>LURISTAN</strong>,"<em>Axe Head</em>","ca. 1200-800 B.C.",Luristan,"Grace H. Dreyfus Collection",1968.35,,,,,,,,,,,,,,,,,,,,,,,,,,,,,,,,,,,,,,,,,,,,,"Axe,Bronze,Luristan,Sculpture,still life",http://art-collections.museum.ucsb.edu/files/original/48635371c09bbc93ca08d7162659f670.jpg,"Physical Object","<strong>The Arts of the Middle East </strong>",1,0
<strong>LURISTAN</strong>,"<em>Mace or Sleeve Handle</em>","ca. 1200-800 B.C.",Luristan,"Grace H. Dreyfus Collection",1968.34,,,,,,,,,,,,,,,,,,,,,,,,,,,,,,,,,,,,,,,,,,,,,"Bronze,Luristan,mace,Sculpture,still life",http://art-collections.museum.ucsb.edu/files/original/4a71759bff2fc7810daaf45051270571.jpg,"Physical Object","<strong>The Arts of the Middle East </strong>",1,0
<strong>LURISTAN</strong>,<em>Bell</em>,"ca. 1200-800 B.C.",Luristan,"Grace H. Dreyfus Collection",1968.33.2,,,,,,,,,,,,,,,,,,,,,,,,,,,,,,,,,,,,,,,,,,,,,"bell,Bronze,Luristan,Sculpture,still life",http://art-collections.museum.ucsb.edu/files/original/2c02d9f27be191f221fb2dc110cf3477.jpg,"Physical Object","<strong>The Arts of the Middle East </strong>",1,0
<strong>LURISTAN</strong>,<em>Bell</em>,"ca. 1200-800 B.C.",Luristan,"Grace H. Dreyfus Collection",1968.33.1,,,,,,,,,,,,,,,,,,,,,,,,,,,,,,,,,,,,,,,,,,,,,"bell,Bronze,Luristan,Sculpture,still life",http://art-collections.museum.ucsb.edu/files/original/d3409d19c57e17e91d0a56da29052814.jpg,"Physical Object","<strong>The Arts of the Middle East </strong>",1,0
<strong>LURISTAN</strong>,<em>Pin</em>,"ca. 1200-800 B.C.",Luristan,"Grace H. Dreyfus Collection",1968.32.3,,,,,,,,,,,,,,,,,,,,,,,,,,,,,,,,,,,,,,,,,,,,,"Bronze,Luristan,pin,Sculpture,still life",http://art-collections.museum.ucsb.edu/files/original/a977772ea02a9ac906e86f512c5156b1.jpg,"Physical Object","<strong>The Arts of the Middle East </strong>",1,0
<strong>LURISTAN</strong>,<em>Pin</em>,"ca. 1200-800 B.C.",Luristan,"Grace H. Dreyfus Collection",1968.32.2,,,,,,,,,,,,,,,,,,,,,,,,,,,,,,,,,,,,,,,,,,,,,"Bronze,Luristan,pin,Sculpture,still life",http://art-collections.museum.ucsb.edu/files/original/67b62541b00f1191559e1b02776a1ce0.jpg,"Physical Object","<strong>The Arts of the Middle East </strong>",1,0
<strong>LURISTAN</strong>,<em>Pin</em>,"ca. 1200-800 B.C.",Luristan,"Grace H. Dreyfus Collection",1968.32.1,,,,,,,,,,,,,,,,,,,,,,,,,,,,,,,,,,,,,,,,,,,,,"Bronze,Luristan,pin,Sculpture,still life",http://art-collections.museum.ucsb.edu/files/original/01b5f86d5c2c635907400fa53dea56fd.jpg,"Physical Object","<strong>The Arts of the Middle East </strong>",1,0
<strong>LURISTAN</strong>,<em>Finial</em>,"ca. 1200-800 B.C.",Luristan,"Grace H. Dreyfus Collection",1968.31,,,,,,,,,,,,,,,,,,,,,,,,,,,,,,,,,,,,,,,,,,,,,"Bronze,finial,Luristan,Sculpture,still life",http://art-collections.museum.ucsb.edu/files/original/56a2678f36cabc2b662a19efbeb075bb.jpg,"Physical Object","<strong>The Arts of the Middle East </strong>",1,0
<strong>LURISTAN</strong>,<em>Torque</em>,"ca. 1200-800 B.C.",Luristan,"Grace H. Dreyfus Collection",1968.29.g,,,,,,,,,,,,,,,,,,,,,,,,,,,,,,,,,,,,,,,,,,,,,"Bronze,Luristan,Sculpture,still life,torque",http://art-collections.museum.ucsb.edu/files/original/d9530a655ae6aeb8ae30d978ad539904.jpg,"Physical Object","<strong>The Arts of the Middle East </strong>",1,0
<strong>LURISTAN</strong>,<em>Bracelet</em>,"ca. 1200-800 B.C.",Luristan,"Grace H. Dreyfus Collection",1968.29.f,,,,,,,,,,,,,,,,,,,,,,,,,,,,,,,,,,,,,,,,,,,,,"Bracelet,Bronze,Jewelry,Luristan,Sculpture,still life",http://art-collections.museum.ucsb.edu/files/original/b99587665720b823aef259911932df74.jpg,"Physical Object","<strong>The Arts of the Middle East </strong>",1,0
<strong>LURISTAN</strong>,<em>Earring</em>,"ca. 1200-800 B.C.",Luristan,"Grace H. Dreyfus Collection",1968.29.e,,,,,,,,,,,,,,,,,,,,,,,,,,,,,,,,,,,,,,,,,,,,,"Bronze,Earrings,Jewelry,Luristan,Sculpture,still life",http://art-collections.museum.ucsb.edu/files/original/a87a805fb8b45e0e041da06a8c9fab86.jpg,"Physical Object","<strong>The Arts of the Middle East </strong>",1,0
<strong>LURISTAN</strong>,<em>Earring</em>,"ca. 1200-800 B.C.",Luristan,"Grace H. Dreyfus Collection",1968.29.d,,,,,,,,,,,,,,,,,,,,,,,,,,,,,,,,,,,,,,,,,,,,,"Bronze,Earrings,Jewelry,Luristan,Sculpture,still life",http://art-collections.museum.ucsb.edu/files/original/332c1f92ee922676b7bc47e8fea7c75f.jpg,"Physical Object","<strong>The Arts of the Middle East </strong>",1,0
<strong>LURISTAN</strong>,<em>Bracelet</em>,"ca. 1200-800 B.C.",Luristan,"Grace H. Dreyfus Collection",1968.29.c,,,,,,,,,,,,,,,,,,,,,,,,,,,,,,,,,,,,,,,,,,,,,"Bracelet,Bronze,Jewelry,Luristan,Sculpture,still life",http://art-collections.museum.ucsb.edu/files/original/6e1bcec4e2bec5b62c50ef4cadd8fe30.jpg,"Physical Object","<strong>The Arts of the Middle East </strong>",1,0
<strong>LURISTAN</strong>,<em>Bracelet</em>,"ca. 1200-800 B.C.",Luristan,"Grace H. Dreyfus Collection",1968.29.b,,,,,,,,,,,,,,,,,,,,,,,,,,,,,,,,,,,,,,,,,,,,,"Bracelet,Bronze,Jewelry,Luristan,Sculpture,still life",http://art-collections.museum.ucsb.edu/files/original/807dcbb29231a892aac9368dffff26a2.jpg,"Physical Object","<strong>The Arts of the Middle East </strong>",1,0
<strong>LURISTAN</strong>,<em>Bracelet</em>,"ca. 1200-800 B.C.",Luristan,"Grace H. Dreyfus Collection",1968.29.a,,,,,,,,,,,,,,,,,,,,,,,,,,,,,,,,,,,,,,,,,,,,,"Bracelet,Bronze,Jewelry,Luristan,Sculpture,still life",http://art-collections.museum.ucsb.edu/files/original/56a474d5774859026b6a98f3da6b90d2.jpg,"Physical Object","<strong>The Arts of the Middle East </strong>",1,0
"<strong>ISLAMIC</strong>, Afghanistan","<em>Head of Maitreya or Buddha</em>","3rd-4th C. A.D.","Islamic, Pakistan or Afghanistan","Grace H. Dreyfus Collection",1981.114,,,,,,,,,,,,,,,,,,,,,,,,,,,,,,,,,,,,,,,,,,,,,,,,"<strong>The Arts of the Middle East </strong>",1,0
"<strong>ISLAMIC</strong>, Mongol Iran","<em>Double folio from a large manuscript of the Qur'an</em>","13th-14th C.","Islamic, Monglo Iran, 13-14th C.","Gift of Mr. and Mrs. Mark Lansburgh",1966.3,,,,,,,,,,,,,,,,,,,,,,,,,,,,,,,,,,,,,,,,,,,,,"Ink,Iran,manuscript,Religion,still life,Watercolor,Works-on-Paper",http://art-collections.museum.ucsb.edu/files/original/dd719d81b4913fe14367f65bf0023611.jpg,,"<strong>The Arts of the Middle East </strong>",1,0