﻿"Dublin Core:Title","Dublin Core:Description","Dublin Core:Date","Dublin Core:Creator","Dublin Core:Source","Dublin Core:Identifier","Dublin Core:Contributor","Dublin Core:Rights","Dublin Core:Relation","Dublin Core:Format","Dublin Core:Language","Dublin Core:Type","Dublin Core:Coverage","Dublin Core:Subject","Dublin Core:Publisher","Item Type Metadata:Birth Date","Item Type Metadata:Birthplace","Item Type Metadata:Event Type","Item Type Metadata:Participants","Item Type Metadata:URL","Item Type Metadata:Death Date","Item Type Metadata:Occupation","Item Type Metadata:Biographical Text","Item Type Metadata:Bibliography","Item Type Metadata:File name","Item Type Metadata:Time Summary","Item Type Metadata:Interviewer","Item Type Metadata:Interviewee","Item Type Metadata:Location","Item Type Metadata:Transcription","Item Type Metadata:Local URL","Item Type Metadata:Original Format","Item Type Metadata:Physical Dimensions","Item Type Metadata:Duration","Item Type Metadata:Compression","Item Type Metadata:Producer","Item Type Metadata:Director","Item Type Metadata:Bit Rate/Frequency","Item Type Metadata:Text","Item Type Metadata:Email Body","Item Type Metadata:Subject Line","Item Type Metadata:From","Item Type Metadata:To","Item Type Metadata:CC","Item Type Metadata:BCC","Item Type Metadata:Number of Attachments","Item Type Metadata:Standards","Item Type Metadata:Objectives","Item Type Metadata:Materials","Item Type Metadata:Tags",tags,file,itemType,collection,public,featured
"<strong>ALMARAZ</strong>, Carlos","<em>1984 Olympic Poster</em>",n.d.,"Almaraz, Carlos, Mexican/American, 1941-1989","Gift of the Olympic Arts Festival",1983.38,,,,,,,,,,,,,,,,,,,,,,,,,,,,,,,,,,,,,,,,,,,,,"abstract,Figurative,Mexican,Olympic,Painting,poster,print,Works-on-Paper",http://art-collections.museum.ucsb.edu/files/original/3dfcd23e7984b5a9927c09b8ce260981.jpg,"Physical Object","<strong>The Arts of Latin America</strong>",1,0
<strong>ANDEAN</strong>,"<em>Virgin and Child</em>",n.d.,"Artist unknown, Andean","Gift of Dr. Stephen S. Goodspeed and Mrs. John Goodspeed Ainsworth",1966.60,,,,,,,,,,,,,,,,,,,,,,,,,,,,,,,,,,,,,,,,,,,,,"Andean,colonial,Jesus,oil,Painting,Religion,Spanish,Virgin Mary",http://art-collections.museum.ucsb.edu/files/original/0fbd230353a0f56502ff15c92c213855.jpg,"Physical Object","<strong>The Arts of Latin America</strong>",1,0
"<strong>Artist unknown, Peruvian</strong>","<em>Mary Magdalene</em>","ca. 1800","<strong>Artist unknown, Peruvian</strong>","Gift of Dr. Stephen S. Goodspeed and Mrs. John Ainsworth Goodspeed",1966.4,,,,,,,,,,,,,,,,,,,,,,,,,,,,,,,,,,,,,,,,,,,,,"Mary Magdalene,oil,Painting,Peruvian,portrait,Religion",http://art-collections.museum.ucsb.edu/files/original/74b8dce75e42700a9aa473469a1a6c3a.jpg,"Physical Object","<strong>The Arts of Latin America</strong>",1,0
"<strong>ARTIST UNKNOWN</strong>","<em>St. Thomas Aquinas</em>",n.d.,"Artist unknown","Gift of Dr. Stephen S. Goodspeed and Mrs. John Goodspeed Ainsworth",1966.39,,,,,,,,,,,,,,,,,,,,,,,,,,,,,,,,,,,,,,,,,,,,,"oil,Painting,Religion,Saint,Saint Thomas",http://art-collections.museum.ucsb.edu/files/original/81ab8fd38996769060ea1b2c11705753.jpg,"Physical Object","<strong>The Arts of Latin America</strong>",1,0
"<strong>Artist unknown</strong>","<em>St. Thomas Aquinas</em>",n.d.,"<strong>Artist unknown</strong>","Gift of Dr. Stephen S. Goodspeed and Mrs. John Goodspeed Ainsworth",1966.39,,,,,,,,,,,,,,,,,,,,,,,,,,,,,,,,,,,,,,,,,,,,,"oil,Painting,portrait,Religion,St Thomas",http://art-collections.museum.ucsb.edu/files/original/11b51710661b96d308f5493262245432.jpg,"Physical Object","<strong>The Arts of Latin America</strong>",1,0
"<strong>BIRK</strong>, Sandow","<em>Old Folsom State Prison - Represa, CA</em>","ca. 2000","Birk, Sandow","Estate of Frances Garvin and Keith Julius Puccinelli",2018.001.008,,,,,,,,,,,,,,,,,,,,,,,,,,,,,,,,,,,,,,,,,,,,,"California,etching,landscape,prison,Works-on-Paper",http://art-collections.museum.ucsb.edu/files/original/847943772bb4ad11cb01fbca267418b9.jpg,"Physical Object","<strong>The Arts of Latin America</strong>",1,0
"<strong>CANTU</strong>, Federico","<em>working cartoon for ""Grisaille Fresco Panels""</em>","20th C.","Cantu, Federico, Mexican, 1908 -","Gift of Mrs. MacKinley Helm in memory of Dr. MacKinley Helm",1964.165,,,,,,,,,,,,,,,,,,,,,,,,,,,,,,,,,,,,,,,,,,,,,,,"Physical Object","<strong>The Arts of Latin America</strong>",1,0
"<strong>CANTU</strong>, Federico","<em>La Caracola</em>",1944,"<strong>CANTU</strong>, Federico","Gift of Mrs. MacKinley Helm in memory of Dr. MacKinley Helm",1963.27,,,,,,,,,,,,,,,,,,,,,,,,,,,,,,,,,,,,,,,,,,,,,"donkey,Ink,Mexican,portrait,Works-on-Paper",http://art-collections.museum.ucsb.edu/files/original/ec9e91a4c6edd0a4cfa9fec7b59b7ebb.jpg,"Physical Object","<strong>The Arts of Latin America</strong>",1,0
"<strong>CANTU</strong>, Federico","<em>Creation of the Unicorn</em>",1939,"<strong>CANTU</strong>, Federico","Gift of Mrs. MacKinley Helm in memory of Dr. MacKinley Helm",1963.29,,,,,,,,,,,,,,,,,,,,,,,,,,,,,,,,,,,,,,,,,,,,,"Ink,Mexican,Mythology,portrait,unicorn,Works-on-Paper",http://art-collections.museum.ucsb.edu/files/original/9aa477c322aa6c29a1e376fc35b9b531.jpg,"Physical Object","<strong>The Arts of Latin America</strong>",1,0
"<strong>CANTU</strong>, Federico","working cartoon for <em>""Grisaille Fresco Panels""</em>","20th C.","<strong>CANTU</strong>, Federico","Gift of Mrs. MacKinley Helm in memory of Dr. MacKinley Helm",1964.165,,,,,,,,,,,,,,,,,,,,,,,,,,,,,,,,,,,,,,,,,,,,,,,"Physical Object","<strong>The Arts of Latin America</strong>",1,0
"<strong>CANTU</strong>, Federico","working cartoon for <em>""Grisaille Fresco Panels""</em>","20th C.","<strong>CANTU</strong>, Federico","Gift of Mrs. MacKinley Helm in memory of Dr. MacKinley Helm",1964.166,,,,,,,,,,,,,,,,,,,,,,,,,,,,,,,,,,,,,,,,,,,,,,,"Physical Object","<strong>The Arts of Latin America</strong>",1,0
"<strong>CANTU</strong>, Federico","<em>The Return of Achilles</em>",1936,"<strong>CANTU</strong>, Federico","Gift of Mrs. MacKinley Helm in memory of Dr. MacKinley Helm",1963.28,,,,,,,,,,,,,,,,,,,,,,,,,,,,,,,,,,,,,,,,,,,,,"landscape,Mexican,Mythology,oil monotype,Painting,Works-on-Paper",http://art-collections.museum.ucsb.edu/files/original/0263d11fe556436ae57ce1b2fdd5c6f5.jpg,"Physical Object","<strong>The Arts of Latin America</strong>",1,0
"<strong>CHILLIDA</strong>, Eduardo","<em>Gezna II</em>",1969,"<strong>CHILLIDA</strong>, Eduardo","Gift of Julia Emerson",1983.53,,,,,,,,,,,,,,,,,,,,,,,,,,,,,,,,,,,,,,,,,,,,,"abstract,black and white,etching,Spanish,Works-on-Paper",http://art-collections.museum.ucsb.edu/files/original/5448cd724c5398036b97cb213f6b6e89.jpg,"Physical Object","<strong>The Arts of Latin America</strong>",1,0
"<strong>COELHO</strong>, Ciro","<em>Stone Breakers #2, Ilha Bela, Brazil</em>",n.d.,"COELHO, Ciro","Gift of Gary Brown",2003.001.001,,,,,,,,,,,,,,,,,,,,,,,,,,,,,,,,,,,,,,,,,,,,,,,"Physical Object","<strong>The Arts of Latin America</strong>",1,0
"<strong>DOSAMENTES</strong>, Francisco","<em>Women of Oaxaca</em>",1946,"Dosamentes, Francisco, Mexican, 1911 -",,1975.89,,,,,,,,,,,,,,,,,,,,,,,,,,,,,,,,,,,,,,,,,,,,,"Lithograph,Mexican,Oaxaca,portrait,print,women,Works-on-Paper",http://art-collections.museum.ucsb.edu/files/original/3ff73a12ad162193c79cdf1cb71d7787.jpg,"Physical Object","<strong>The Arts of Latin America</strong>",1,0
"<strong>GUATEMALAN OR HONDURAN</strong>","<em>Standing Virgin Mary</em>",n.d.,"Artist unknown, Guatemalan or Honduran","Gift of Mrs. Edwin Brooks",1959.3,,,,,,,,,,,,,,,,,,,,,,,,,,,,,,,,,,,,,,,,,,,,,"Carved,carved wood,Religion,Sculpture,Wood",http://art-collections.museum.ucsb.edu/files/original/6e3f9765a4cf28c18edf68f1f7e2aa54.jpg,"Physical Object","<strong>The Arts of Latin America</strong>",1,0
"<strong>GUATEMALAN OR HONDURAN</strong>","<em>Priest with Bible, Standing on Dias</em>",n.d.,"Artist unknown, Guatemalan or Honduran","Gift of Mrs. Edwin Brooks",1959.5,,,,,,,,,,,,,,,,,,,,,,,,,,,,,,,,,,,,,,,,,,,,,"Bible,priest,Religion,Sculpture,statue,Wood",http://art-collections.museum.ucsb.edu/files/original/045fed2ad83b4375a40df402318d629f.jpg,"Physical Object","<strong>The Arts of Latin America</strong>",1,0
<strong>GUATEMALAN</strong>,"<em>Torso of Man Praying</em>","18th century","Artist unknown, Guatemalan","Gift of Mrs. Edwin Brooks",1959.4,,,,,,,,,,,,,,,,,,,,,,,,,,,,,,,,,,,,,,,,,,,,,"Guatemalan,man,pray,Religion,Sculpture,Wood",http://art-collections.museum.ucsb.edu/files/original/fe8f581ed3c57858fa8c491aec6b6da7.jpg,"Physical Object","<strong>The Arts of Latin America</strong>",1,0
<strong>GUATEMALAN</strong>,"<em>Torso of a Woman Praying</em>","18th C.","Artist unknown, Guatemalan","Gift of Mrs. Edwin Brooks",1959.6,,,,,,,,,,,,,,,,,,,,,,,,,,,,,,,,,,,,,,,,,,,,,"Carved,carved wood,Guatemalan,pray,relief,Religion,Sculpture,woman,Wood",http://art-collections.museum.ucsb.edu/files/original/53f4ed39e394067515dda8ba3aef70ec.jpg,"Physical Object","<strong>The Arts of Latin America</strong>",1,0
<strong>GUATEMALAN</strong>,"<em>Padre and Volcanoes</em>","18th C.","Artist unknown, Guatemalan","Gift of Mrs. Edwin Brooks",1959.7,,,,,,,,,,,,,,,,,,,,,,,,,,,,,,,,,,,,,,,,,,,,,"Carved,carved wood,Guatemalan,Padre,relief,Religion,Sculpture,Wood",http://art-collections.museum.ucsb.edu/files/original/20020fe0a784fcad782c30598c4aeb99.jpg,"Physical Object","<strong>The Arts of Latin America</strong>",1,0
"<strong>Helguera</strong>, Pablo","<em>An Accident: America</em>",2007,"<strong>Helguera</strong>, Pablo","Gift of the artist",2018.010.001,,,,,,,,,,,,,,,,,,,,,,,,,,,,,,,,,,,,,,,,,,,,,"abstract,America,collage,Mexican,Works-on-Paper",http://art-collections.museum.ucsb.edu/files/original/a8e4bb344f40dc146acb882891eeab88.jpg,"Physical Object","<strong>The Arts of Latin America</strong>",1,0
"<strong>MERIDA</strong>, Carlos",<em>Untitled</em>,1934,"Merida, Carlos, Mexican, 1891 -",,1973.49,,,,,,,,,,,,,,,,,,,,,,,,,,,,,,,,,,,,,,,,,,,,,"abstract,Lithograph,Mexican,print,Works-on-Paper",http://art-collections.museum.ucsb.edu/files/original/7d2d8a4f4cb213d3d7d2b2062f3d0f4b.jpg,"Physical Object","<strong>The Arts of Latin America</strong>",1,0
"<strong>MERIDA</strong>, Carlos",<em>Untitled</em>,1934,"Merida, Carlos, Mexican, 1891 -",,1973.50,,,,,,,,,,,,,,,,,,,,,,,,,,,,,,,,,,,,,,,,,,,,,"abstract,Lithograph,Mexican,print,Works-on-Paper",http://art-collections.museum.ucsb.edu/files/original/3b26bca878bf8668a0deb519de7a2f5e.jpg,"Physical Object","<strong>The Arts of Latin America</strong>",1,0
"<strong>MERIDA</strong>, Carlos",<em>Untitled</em>,1934,"Merida, Carlos, Mexican, 1891 -",,1973.51,,,,,,,,,,,,,,,,,,,,,,,,,,,,,,,,,,,,,,,,,,,,,"abstract,Figurative,Lithograph,Mexican,print,Works-on-Paper",http://art-collections.museum.ucsb.edu/files/original/5914cd8266c56b42da3bf644a758711f.jpg,"Physical Object","<strong>The Arts of Latin America</strong>",1,0
"<strong>MERIDA</strong>, Carlos",<em>Untitled</em>,"20th. C.","Merida, Carlos, Mexican, 1891 -",,1973.52,,,,,,,,,,,,,,,,,,,,,,,,,,,,,,,,,,,,,,,,,,,,,"abstract,Figurative,Lithograph,Mexican,print,Works-on-Paper",http://art-collections.museum.ucsb.edu/files/original/1d114497eab9c475506c1cf2f79905df.jpg,"Physical Object","<strong>The Arts of Latin America</strong>",1,0
"<strong>MERIDA</strong>, Carlos",<em>Untitled</em>,1934,"<strong>MERIDA</strong>, Carlos",,1973.49,,,,,,,,,,,,,,,,,,,,,,,,,,,,,,,,,,,,,,,,,,,,,"abstract,Lithograph,Mexican,print,Works-on-Paper",http://art-collections.museum.ucsb.edu/files/original/4999ccce9e5de090a9719b37ed38e1d4.jpg,"Physical Object","<strong>The Arts of Latin America</strong>",1,0
"<strong>MERIDA</strong>, Carlos",<em>Untitled</em>,1934,"<strong>MERIDA</strong>, Carlos",,1973.5,,,,,,,,,,,,,,,,,,,,,,,,,,,,,,,,,,,,,,,,,,,,,"abstract,Lithograph,Mexican,print,Works-on-Paper",http://art-collections.museum.ucsb.edu/files/original/01a2688f7f809d3a820c021556eab899.jpg,"Physical Object","<strong>The Arts of Latin America</strong>",1,0
"<strong>MERIDA</strong>, Carlos",Untitled,1934,"<strong>MERIDA</strong>, Carlos",,1973.51,,,,,,,,,,,,,,,,,,,,,,,,,,,,,,,,,,,,,,,,,,,,,"abstract,Figurative,Lithograph,Mexican,print,Works-on-Paper",http://art-collections.museum.ucsb.edu/files/original/853bdc88a1fce79772cb1813087337b6.jpg,"Physical Object","<strong>The Arts of Latin America</strong>",1,0
"<strong>MERIDA</strong>, Carlos",<em>Untitled</em>,"20th C.","<strong>MERIDA</strong>, Carlos",,1973.52,,,,,,,,,,,,,,,,,,,,,,,,,,,,,,,,,,,,,,,,,,,,,"abstract,Figurative,Lithograph,Mexican,print,Works-on-Paper",http://art-collections.museum.ucsb.edu/files/original/8ee5b867f2f847f60b971d34406d5289.jpg,"Physical Object","<strong>The Arts of Latin America</strong>",1,0
<strong>MEXICAN</strong>,"<em>Walking Priest (Possibly St. Francis of Assissi)</em>","c. 1725","Artist unknown, Mexico","Gift of Mrs. Edwin Brooks",1959.1,,,,,,,,,,,,,,,,,,,,,,,,,,,,,,,,,,,,,,,,,,,,,"Mexican,Religion,Saint,Sculpture,Wood",http://art-collections.museum.ucsb.edu/files/original/e72ec33ed42cf4eda61de7afddb6c0ab.jpg,"Physical Object","<strong>The Arts of Latin America</strong>",1,0
<strong>MEXICAN</strong>,"<em>Fragment from an Altar Front: Holy Family</em>","mid 18th century","Artist unknown, Mexican","Gift of Mrs. Edwin Brooks",1959.10,,,,,,,,,,,,,,,,,,,,,,,,,,,,,,,,,,,,,,,,,,,,,"carved wood,Mexican,Religion,Sculpture,Wood",http://art-collections.museum.ucsb.edu/files/original/d05c02f78977715514653182b0f52f66.JPG,"Physical Object","<strong>The Arts of Latin America</strong>",1,0
<strong>MEXICAN</strong>,"<em>Baroque Panel of Patroness Saint</em>","mid 17th century","Artist Unknown, Mexico","Gift of Mrs. Edwin Brooks",1959.11,,,,,,,,,,,,,,,,,,,,,,,,,,,,,,,,,,,,,,,,,,,,,"Carved,carved wood,Mexican,Religion,Saint,Sculpture,Wood",http://art-collections.museum.ucsb.edu/files/original/815a42dafd5be5398aa6a95556c2de79.jpg,"Physical Object","<strong>The Arts of Latin America</strong>",1,0
<strong>MEXICAN</strong>,"<em>The Holy Trinity</em>",n.d.,"Artist unknown, Mexican","Gift of Dr. Stephen S. Goodspeed and Mrs. John Goodspeed Ainsworth",1966.54,,,,,,,,,,,,,,,,,,,,,,,,,,,,,,,,,,,,,,,,,,,,,"Holy Trinity,Mexican,oil,Painting,Religion",http://art-collections.museum.ucsb.edu/files/original/3839d817a842914e1081718f7f233556.jpg,"Physical Object","<strong>The Arts of Latin America</strong>",1,0
<strong>MEXICAN</strong>,"<em>Virgin of the Rosary with St. Dominic and St. Francis</em>","18th c.","Artist unknown, Mexican","Gift of Dr. Stephen S. Goodspeed and Mrs. John Goodspeed Ainsworth",1966.57,,,,,,,,,,,,,,,,,,,,,,,,,,,,,,,,,,,,,,,,,,,,,"Mexican,oil,Painting,panel,Religion,Rosary,Saint,Wood",http://art-collections.museum.ucsb.edu/files/original/f8432f52999526989e326e04e2084026.jpg,"Physical Object","<strong>The Arts of Latin America</strong>",1,0
<strong>MEXICAN</strong>,"<em>Archbishop with Christ Child</em>",n.d.,"Artist unknown, Mexican","Gift of Dr. Stephen S. Goodspeed and Mrs. John Goodspeed Ainsworth",1966.61,,,,,,,,,,,,,,,,,,,,,,,,,,,,,,,,,,,,,,,,,,,,,"Archbishop,Christ,colonial,Mexican,oil,Painting,Religion,Saint,Spanish",http://art-collections.museum.ucsb.edu/files/original/3f7c702edbde4fd2835534ad63a7610d.jpg,"Physical Object","<strong>The Arts of Latin America</strong>",1,0
<strong>MEXICAN</strong>,<em>Queretero</em>,"ca. 1892","Artist unknown, Mexican","Gift of Miss Margaret Mallory, Dean's Office Purchase Fund",1984.167,,,,,,,,,,,,,,,,,,,,,,,,,,,,,,,,,,,,,,,,,,,,,"cyanotype,Mexican,Photograpgh,portrait,print",http://art-collections.museum.ucsb.edu/files/original/ab7a7f932566ae5cb323767fdefb70ab.jpg,"Physical Object","<strong>The Arts of Latin America</strong>",1,0
<strong>MEXICAN</strong>,"<em>Sugar Bowl</em>",n.d.,"Mexican, Artist Unknown","Gift of Julia Emerson",1984.7,,,,,,,,,,,,,,,,,,,,,,,,,,,,,,,,,,,,,,,,,,,,,"bowl,Mexican,Sculpture,silver,still life",http://art-collections.museum.ucsb.edu/files/original/73213066e51473c833d0f6c660b301f0.jpg,"Physical Object","<strong>The Arts of Latin America</strong>",1,0
"<strong>MEXICAN</strong>, <strong>HUICHOL PEOPLE</strong>","<em>Huichol Mexican Mask</em>","ca. 1930","Artist unknown, Mexican","Estate of Frances Garvin and Keith Julius Puccinelli",2018.001.003,,,,,,,,,,,,,,,,,,,,,,,,,,,,,,,,,,,,,,,,,,,,,"Beads,Figurative,indigenous,Mask,Mexican,Sculpture,still life,Wood",http://art-collections.museum.ucsb.edu/files/original/54fad4d7679502cd7f8bc820e57dc827.jpg,"Physical Object","<strong>The Arts of Latin America</strong>",1,0
"<strong>MEXICAN</strong>, <strong>HUICHOL PEOPLE</strong>","<em>Huichol Mexican Mask</em>","ca. 1930","Artist unknown, Mexican","Estate of Frances Garvin and Keith Julius Puccinelli",2018.001.004,,,,,,,,,,,,,,,,,,,,,,,,,,,,,,,,,,,,,,,,,,,,,"Beads,indigenous,Mask,Mexican,Sculpture,still life,Wood",http://art-collections.museum.ucsb.edu/files/original/e735324005502fe05a737a95f9e127dc.jpg,"Physical Object","<strong>The Arts of Latin America</strong>",1,0
"<strong>MEXICAN</strong>, <strong>HUICHOL PEOPLE</strong>","<em>Huichol Mexican Mask</em>","ca. 1930","Artist unknown, Mexican","Estate of Frances Garvin and Keith Julius Puccinelli",2018.001.005,,,,,,,,,,,,,,,,,,,,,,,,,,,,,,,,,,,,,,,,,,,,,"Beads,indigenous,Mask,Mexican,Sculpture,still life,Wood",http://art-collections.museum.ucsb.edu/files/original/294d03fd3d56acf536169eec366ab757.jpg,"Physical Object","<strong>The Arts of Latin America</strong>",1,0
"<strong>MEXICAN</strong>, <strong>HUICHOL PEOPLE</strong>","<em>Huichol Mexican mask</em>","ca. 1930","Artist unknown, Mexican","Estate of Frances Garvin and Keith Julius Puccinelli",2018.001.006,,,,,,,,,,,,,,,,,,,,,,,,,,,,,,,,,,,,,,,,,,,,,"Beads,Figurative,indigenous,Mask,Mexican,Sculpture,still life,Wood",http://art-collections.museum.ucsb.edu/files/original/c727aebeb480fec44ec6e23f68e430e4.jpg,"Physical Object","<strong>The Arts of Latin America</strong>",1,0
"<strong>MEXICAN</strong>, <strong>HUICHOL PEOPLE</strong>","<em>Huichol, Mexican mask</em>","ca. 1930","Artist unknown, Mexican","Estate of Frances Garvin and Keith Julius Puccinelli",2018.001.007,,,,,,,,,,,,,,,,,,,,,,,,,,,,,,,,,,,,,,,,,,,,,"Beads,indigenous,Mask,Mexican,Sculpture,still life,Wood",http://art-collections.museum.ucsb.edu/files/original/ff16d1d66daee49f79f6a6962326a78f.jpg,"Physical Object","<strong>The Arts of Latin America</strong>",1,0
<strong>PERUVIAN</strong>,"<em>Mary Magdalene</em>","ca. 1800","Artist unknown, Peruvian","Gift of Dr. Stephen S. Goodspeed and Mrs. John Ainsworth Goodspeed",1966.40,,,,,,,,,,,,,,,,,,,,,,,,,,,,,,,,,,,,,,,,,,,,,"Mary Magdalene,oil,Painting,Peruvian,Religion",http://art-collections.museum.ucsb.edu/files/original/625212ea59750eed6d8ea9d8592672e1.jpg,"Physical Object","<strong>The Arts of Latin America</strong>",1,0
"<strong>PINEDA</strong>, J.","<em>Untitled (man and boy embracing)</em>",1968,"<strong>PINEDA</strong>, J.","Gift of Professor Alfred Moir",1973.13,,,,,,,,,,,,,,,,,,,,,,,,,,,,,,,,,,,,,,,,,,,,,,,"Physical Object","<strong>The Arts of Latin America</strong>",1,0
"<strong>SOUTH/CENTRAL AMERICA</strong>","<em>Archangel Gabriel?</em>",n.d.,"Artist unknown, South/Central America","Gift of Dr. Stephen S. Goodspeed and Mrs. John Goodspeed Ainsworth",1966.52,,,,,,,,,,,,,,,,,,,,,,,,,,,,,,,,,,,,,,,,,,,,,"Archangel,colonial,oil,Painting,Religion,Spanish",http://art-collections.museum.ucsb.edu/files/original/611b4dcfa1edf4c3cdf0dcb990d0e7aa.jpg,"Physical Object","<strong>The Arts of Latin America</strong>",1,0
"<strong>SOUTH/CENTRAL AMERICA</strong>","<em>Virgin of the Rosary</em>","ca. 18th - 19th C.","Artist unknown, South/Central America","Gift of Dr. Stephen S. Goodspeed and Mrs. John Goodspeed Ainsworth",1966.58,,,,,,,,,,,,,,,,,,,,,,,,,,,,,,,,,,,,,,,,,,,,,"oil,Painting,Religion,Rosary,tin",http://art-collections.museum.ucsb.edu/files/original/91be0c28e2fe27967d19028df27194cc.jpg,"Physical Object","<strong>The Arts of Latin America</strong>",1,0
"<strong>SOUTH/CENTRAL AMERICAN, ANDEAN</strong>","<em>Our Lady of Candlemas</em>","late 18th, early 19th century","Artist unknown, South/Central America, Andean","Gift of Dr. Stephen S. Goodspeed and Mrs. John Goodspeed Ainsworth",1966.43,,,,,,,,,,,,,,,,,,,,,,,,,,,,,,,,,,,,,,,,,,,,,"Andean,colonial,oil,Painting,Religion,Spanish",http://art-collections.museum.ucsb.edu/files/original/17bf5b24a696bbb4a700e052b165f42c.jpg,"Physical Object","<strong>The Arts of Latin America</strong>",1,0
"<strong>SOUTH/CENTRAL AMERICAN</strong>","<em>St. Michael</em>","18h C.","Artist unknown, South/Central American","Gift of Anonymous Donor",1959.54,,,,,,,,,,,,,,,,,,,,,,,,,,,,,,,,,,,,,,,,,,,,,"Painting,Religion,Saint,Saint Michael,stucco,tin",http://art-collections.museum.ucsb.edu/files/original/d0ca28b15381aaa26db1f537e610b1c9.jpg,"Physical Object","<strong>The Arts of Latin America</strong>",1,0
"<strong>SOUTH/CENTRAL AMERICAN</strong>","<em>Santo, St. Francis</em>",n.d.,"Artist unknown, South/Central American","Gift of Dr. Stephen S. Goodspeed and Mrs. John Goodspeed Ainsworth",1966.101,,,,,,,,,,,,,,,,,,,,,,,,,,,,,,,,,,,,,,,,,,,,,"oil,Painting,panel,Religion,Saint,Wood",http://art-collections.museum.ucsb.edu/files/original/c043f219d43d5b5c5c62bcc80b8c1d43.jpg,"Physical Object","<strong>The Arts of Latin America</strong>",1,0
"<strong>SOUTH/CENTRAL AMERICAN</strong>","<em>Saint Dominic with Monstrance</em>",n.d.,"Artist unknown, South/Central American","Gift of Stephen Goodspeed",1966.35.2,,,,,,,,,,,,,,,,,,,,,,,,,,,,,,,,,,,,,,,,,,,,,"oil,Painting,Religion,Saint,silver",http://art-collections.museum.ucsb.edu/files/original/13878287098f7af02491a49f54d3da11.jpg,"Physical Object","<strong>The Arts of Latin America</strong>",1,0
"<strong>SOUTH/CENTRAL AMERICAN</strong>","<em>San Ram Nonato</em>",n.d.,"Artist unknown, South/Central American","Gift of Dr. Stephen Goodspeed",1966.36.2,,,,,,,,,,,,,,,,,,,,,,,,,,,,,,,,,,,,,,,,,,,,,"colonial,oil,Painting,Religion,Saint,Spanish",http://art-collections.museum.ucsb.edu/files/original/525f8145f301ee2161e3e2c8a58de995.jpg,"Physical Object","<strong>The Arts of Latin America</strong>",1,0
"<strong>SOUTH/CENTRAL AMERICAN</strong>","<em>Virgin Mary</em>","ca. 1750","Artist unknown, South/Central American","Gift of Dr. Stephen Goodspeed and Mrs. John Goodspeed Ainsworth",1966.38,,,,,,,,,,,,,,,,,,,,,,,,,,,,,,,,,,,,,,,,,,,,,"fabric,oil,Painting,Religion,Textile,Virgin Mary",http://art-collections.museum.ucsb.edu/files/original/6470aa3b984e77df7ce9e1bc99b0762e.jpg,"Physical Object","<strong>The Arts of Latin America</strong>",1,0
"<strong>SOUTH/CENTRAL AMERICAN</strong>","<em>Saint Theresa</em>",n.d.,"Artist unknown, South/Central America","Gift of Dr. Stephen S. Goodspeed and Mrs. John Goodspeed Ainsworth",1966.45,,,,,,,,,,,,,,,,,,,,,,,,,,,,,,,,,,,,,,,,,,,,,"colonial,oil,Painting,Religion,Saint,Saint Theresa,Spanish",http://art-collections.museum.ucsb.edu/files/original/ee09ac1b6ebb406d139d1ce44d16b3b1.jpg,"Physical Object","<strong>The Arts of Latin America</strong>",1,0
"<strong>SOUTH/CENTRAL AMERICAN</strong>","<em>St. Rose of Limas</em>",n.d.,"Artist unknown, South/Central America","Gift of Dr. Stephen S. Goodspeed and Mrs. John Goodspeed Ainsworth",1966.47,,,,,,,,,,,,,,,,,,,,,,,,,,,,,,,,,,,,,,,,,,,,,"oil,Painting,Religion,Saint,Saint Rose",http://art-collections.museum.ucsb.edu/files/original/ee4d39c8a91adf86d4c4d375dcdeaf1c.jpg,"Physical Object","<strong>The Arts of Latin America</strong>",1,0
"<strong>SOUTH/CENTRAL AMERICAN</strong>","<em>Virgin of Mercy with St. Augustine and St. Jerome</em>","ca. 18th C.","Artist unknown, South/Central America","Gift of Dr. Stephen S. Goodspeed and Mrs. John Goodspeed Ainsworth",1966.48,,,,,,,,,,,,,,,,,,,,,,,,,,,,,,,,,,,,,,,,,,,,,"colonial,oil,Painting,Religion,Saint,Spanish",http://art-collections.museum.ucsb.edu/files/original/7eb69beb621510a3606d0f8b1cdcfb07.jpg,"Physical Object","<strong>The Arts of Latin America</strong>",1,0