﻿"Dublin Core:Title","Dublin Core:Description","Dublin Core:Date","Dublin Core:Creator","Dublin Core:Source","Dublin Core:Identifier","Dublin Core:Contributor","Dublin Core:Rights","Dublin Core:Relation","Dublin Core:Format","Dublin Core:Language","Dublin Core:Type","Dublin Core:Coverage","Dublin Core:Subject","Dublin Core:Publisher","Item Type Metadata:Birth Date","Item Type Metadata:Birthplace","Item Type Metadata:Event Type","Item Type Metadata:Participants","Item Type Metadata:URL","Item Type Metadata:Death Date","Item Type Metadata:Occupation","Item Type Metadata:Biographical Text","Item Type Metadata:Bibliography","Item Type Metadata:File name","Item Type Metadata:Time Summary","Item Type Metadata:Interviewer","Item Type Metadata:Interviewee","Item Type Metadata:Location","Item Type Metadata:Transcription","Item Type Metadata:Local URL","Item Type Metadata:Original Format","Item Type Metadata:Physical Dimensions","Item Type Metadata:Duration","Item Type Metadata:Compression","Item Type Metadata:Producer","Item Type Metadata:Director","Item Type Metadata:Bit Rate/Frequency","Item Type Metadata:Text","Item Type Metadata:Email Body","Item Type Metadata:Subject Line","Item Type Metadata:From","Item Type Metadata:To","Item Type Metadata:CC","Item Type Metadata:BCC","Item Type Metadata:Number of Attachments","Item Type Metadata:Standards","Item Type Metadata:Objectives","Item Type Metadata:Materials","Item Type Metadata:Tags",tags,file,itemType,collection,public,featured
"<strong>WOUWERMAN,</strong> Phillips","<em>Haying Scene</em>","ca. 1640","<strong>WOUWERMAN</strong>, Phillips","Gift of Mrs. Elizabeth Pringle",1984.240,,,,,,,,,,,,,,,,,,,,,,,,,,,,,,,,,,,,,,,,,,,,,"farm,hay,horses,landscape,oil,Painting,smoke",http://art-collections.museum.ucsb.edu/files/original/ef3f2060b0de51a6e4ade969026dc778.jpg,"Physical Object",<strong>Paintings</strong>,1,0
"<strong>WOJNAROWICZ</strong>, David",<em>Hunger</em>,1988,"<strong>WOJNAROWICZ</strong>, David","Gift of Robert H. Halff",1990.9,,,,,,,,,,,,,,,,,,,,,,,,,,,,,,,,,,,,,,,,,,,,,"aids,Figurative,Mixed Media,Painting,works on paper",http://art-collections.museum.ucsb.edu/files/original/a3464e1fe5554ca3d1903104d4f00cc1.jpg,"Physical Object",<strong>Paintings</strong>,1,0
"<strong>WITEK</strong>, Joan","<em>Islamic Compulsion</em>",1977,"<strong>WITEK</strong>, Joan",,1986.302,,,,,,,,,,,,,,,,,,,,,,,,,,,,,,,,,,,,,,,,,,,,,,,"Physical Object",<strong>Paintings</strong>,1,0
"<strong>WILLIAMS</strong>, Megan","<em>Fire Handler</em>",1995,"<strong>WILLIAMS</strong>, Megan","Gift of Dean Valentine and Amy Adelson",1999.98,,,,,,,,,,,,,,,,,,,,,,,,,,,,,,,,,,,,,,,,,,,,,,,"Physical Object",<strong>Paintings</strong>,1,0
"<strong>WILLIAMS</strong>, John","<em>Untitled (Red Tornado)</em>",2010,"<strong>WILLIAMS</strong>, John","Gift of Marc Selwyn Fine Art, Beverly Hills",2018.017.009,,,,,,,,,,,,,,,,,,,,,,,,,,,,,,,,,,,,,,,,,,,,,"abstract,mixed colors,multi-colored,oil,Painting",http://art-collections.museum.ucsb.edu/files/original/4ee3f12c3e6315b8bf577f1c05ccbf8b.jpg,"Physical Object",<strong>Paintings</strong>,1,0
"<strong>WESTFALL</strong>, Stephen",<em>Argus</em>,2015,"<strong>WESTFALL</strong>, Stephen","Museum purchase",2015.011.001,,,,,,,,,,,,,,,,,,,,,,,,,,,,,,,,,,,,,,,,,,,,,"abstract,multi-colored,mural,Painting,Pattern",http://art-collections.museum.ucsb.edu/files/original/37841cb6f8b5a806c60424458801ae60.jpg,"Physical Object",<strong>Paintings</strong>,1,0
"<strong>WESTFALL</strong>, Stephen",<em>Sandalwood</em>,2013,"<strong>WESTFALL</strong>, Stephen","Gift of the artist",2014.020.001,,,,,,,,,,,,,,,,,,,,,,,,,,,,,,,,,,,,,,,,,,,,,"abstract,grid,multi-colored,Painting,Pattern",http://art-collections.museum.ucsb.edu/files/original/a15ad606966c34db83a5cd12ceac8348.jpg,"Physical Object",<strong>Paintings</strong>,1,0
"<strong>WAYNE</strong>, Leslie","<em>One Big Love, #58</em>",2011,"<strong>WAYNE</strong>, Leslie","Gift of the artist and Jack Shainman Gallery, New York",2014.015.001,,,,,,,,,,,,,,,,,,,,,,,,,,,,,,,,,,,,,,,,,,,,,"abstract,Blue,layers,oil,Painting,three dimensional,White",http://art-collections.museum.ucsb.edu/files/original/a8089dc43e094b20326f04e4f3e3b9d7.jpg,"Physical Object",<strong>Paintings</strong>,1,0
"<strong>WAY</strong>, John","<em>February No. 5</em>",2001,"<strong>WAY</strong>, John","Gift of Qi Pan",2003.006.005,,,,,,,,,,,,,,,,,,,,,,,,,,,,,,,,,,,,,,,,,,,,,"abstract,Black,green,Painting,Yellow",http://art-collections.museum.ucsb.edu/files/original/dad23bb3696852e64d5ab0302e1c48fb.JPG,"Physical Object",<strong>Paintings</strong>,1,0
"<strong>WAY</strong>, John","<em>May No. 5</em>",2001,"<strong>WAY</strong>, John","Gift of Qi Pan",2003.006.004,,,,,,,,,,,,,,,,,,,,,,,,,,,,,,,,,,,,,,,,,,,,,"abstract,Black,Blue,green,oil,Painting,White",http://art-collections.museum.ucsb.edu/files/original/044ea98704d6abf8da9037bf2ed70b4e.jpg,"Physical Object",<strong>Paintings</strong>,1,0
"<strong>WAY</strong>, John","<em>September No. 5</em>",2000,"<strong>WAY</strong>, John","Gift of Qi Pan",2003.006.003,,,,,,,,,,,,,,,,,,,,,,,,,,,,,,,,,,,,,,,,,,,,,"abstract,Black,green,oil,Painting,White",http://art-collections.museum.ucsb.edu/files/original/9fc57353550cd1b37839040f1061f0ba.jpg,"Physical Object",<strong>Paintings</strong>,1,0
"<strong>WAY</strong>, John","<em>October No. 5</em>",2000,"<strong>WAY</strong>, John","Gift of Qi Pan",2003.006.002,,,,,,,,,,,,,,,,,,,,,,,,,,,,,,,,,,,,,,,,,,,,,"abstract,Black,Blue,oil,orange,Painting",http://art-collections.museum.ucsb.edu/files/original/eade59d95e9fed5fa4e4feeca30fbb42.jpg,"Physical Object",<strong>Paintings</strong>,1,0
"<strong>WAY</strong>, John","<em>June No. 5</em>",2000,"<strong>WAY</strong>, John","Gift of Qi Pan",2003.006.001,,,,,,,,,,,,,,,,,,,,,,,,,,,,,,,,,,,,,,,,,,,,,"abstract,Black,Blue,green,oil,orange,Painting",http://art-collections.museum.ucsb.edu/files/original/712accceaaacc4b76583030d23f16ccc.jpg,"Physical Object",<strong>Paintings</strong>,1,0
"<strong>VAN OFREN</strong>, Michael",<em>Untitled</em>,2004,"<strong>VAN OFREN</strong>, Michael","Gift of Marc Selwyn Fine Art, Beverly Hills",2018.017.014,,,,,,,,,,,,,,,,,,,,,,,,,,,,,,,,,,,,,,,,,,,,,"abstract,Black,Blue,brown,Painting",http://art-collections.museum.ucsb.edu/files/original/ba4806623f459eb65ad0b64be016d0da.jpg,"Physical Object",<strong>Paintings</strong>,1,0
"<strong>TUOMI</strong>, Kenneth",<em>Untitled</em>,n.d.,"<strong>TUOMI</strong>, Kenneth",1968.96,1968.96,,,,,,,,,,,,,,,,,,,,,,,,,,,,,,,,,,,,,,,,,,,,,,,"Physical Object",<strong>Paintings</strong>,1,0
"<strong>TOMPKINS,</strong> Sue","<em>Endless Love</em>",2005,"<strong>TOMPKINS</strong>, Sue","Gift of Marc Selwyn Fine Art, Beverly Hills",2018.017.022,,,,,,,,,,,,,,,,,,,,,,,,,,,,,,,,,,,,,,,,,,,,,"acrylic,Black,Figurative,green,Love,painitng",http://art-collections.museum.ucsb.edu/files/original/950b8da1f060f4e942fdb7772d510db3.jpg,"Physical Object",<strong>Paintings</strong>,1,0
"<strong>TOLBERT</strong>, Shane","<em>Unknown Title</em>",2008,"<strong>TOLBERT</strong>, Shane","Estate of Frances Garvin and Keith Julius Puccinelli",2018.001.095,,,,,,,,,,,,,,,,,,,,,,,,,,,,,,,,,,,,,,,,,,,,,"abstract,Black,multi-colored,Painting,square",http://art-collections.museum.ucsb.edu/files/original/7d17a7a7d5cc8d9a0fbc7fc1272ad0ae.jpg,"Physical Object",<strong>Paintings</strong>,1,0
"<strong>TIVEY</strong>, Hap","<em>Gamma Spectrum Clouds</em>",1989,"<strong>TIVEY</strong>, Hap","Gift of Foster A. Reed and C.L. Reed, III",1996.29,,,,,,,,,,,,,,,,,,,,,,,,,,,,,,,,,,,,,,,,,,,,,"abstract,burlap,dark,oil,Painting",http://art-collections.museum.ucsb.edu/files/original/a49b76a8d69f66281af018652d00f794.jpg,"Physical Object",<strong>Paintings</strong>,1,0
"<strong>TIVEY</strong>, Hap","<em>Chryse Planitia</em>",1978,"<strong>TIVEY</strong>, Hap","Gift of Betty and Bob Klausner",1994.18,,,,,,,,,,,,,,,,,,,,,,,,,,,,,,,,,,,,,,,,,,,,,,,"Physical Object",<strong>Paintings</strong>,1,0
"<strong>TIEPOLO</strong>, Giambattista (After)","<em>Hope, Faith, and Charity</em>",n.d.,"<strong>TIEPOLO</strong>, Giambattista (After)","Gift of Nicole Underwood",1995.28,,,,,,,,,,,,,,,,,,,,,,,,,,,,,,,,,,,,,,,,,,,,,"Clouds,italian,oil,Painting,Religion",http://art-collections.museum.ucsb.edu/files/original/7620c8d737c85c63ea961b9c5e5c86b8.jpg,"Physical Object",<strong>Paintings</strong>,1,0
"<strong>TETHEROW</strong>, Michael","<em>Untitled #7</em>",1976,"<strong>TETHEROW</strong>, Michael","Gift of Daniel Weinberg",1990.13,,,,,,,,,,,,,,,,,,,,,,,,,,,,,,,,,,,,,,,,,,,,,"20th century,abstract,linen,oil,Painting",http://art-collections.museum.ucsb.edu/files/original/a3a464f7b817b57536b09a3a83dca9d0.JPG,"Physical Object",<strong>Paintings</strong>,1,0
"<strong>TASLEY</strong>, Matt",<em>N.Y.C.</em>,1985,"<strong>TASLEY</strong>, Matt","Gift of Gary H. Brown",1992.187,,,,,,,,,,,,,,,,,,,,,,,,,,,,,,,,,,,,,,,,,,,,,,,"Physical Object",<strong>Paintings</strong>,1,0
"<strong>STRASBURG</strong>, Nicole","<em>Paris Metro</em>",1994,"<strong>STRASBURG</strong>, Nicole","Estate of Frances Garvin and Keith Julius Puccinelli",2018.001.089,,,,,,,,,,,,,,,,,,,,,,,,,,,,,,,,,,,,,,,,,,,,,"20th century,architecture,metro,Painting,Paris",http://art-collections.museum.ucsb.edu/files/original/2a3aff1761d22bbaeb2af10080632183.jpg,"Physical Object",<strong>Paintings</strong>,1,0
"<strong>STRASBURG</strong>, Nicole","<em>After Turner...</em>",1994,"<strong>STRASBURG</strong>, Nicole","Estate of Frances Garvin and Keith Julius Puccinelli",2018.001.088,,,,,,,,,,,,,,,,,,,,,,,,,,,,,,,,,,,,,,,,,,,,,"cloudy,dark,landscape,oil,Painting",http://art-collections.museum.ucsb.edu/files/original/05151f2e3acaeca29996e5525588d472.jpg,"Physical Object",<strong>Paintings</strong>,1,0
"<strong>STOERCHLE</strong>, Wolfgang",<em>Untitled</em>,"ca. 1968","<strong>STOERCHLE</strong>, Wolfgang",,1977.1,,,,,,,,,,,,,,,,,,,,,,,,,,,,,,,,,,,,,,,,,,,,,"abstract,canvas,Figurative,oil,Painting",http://art-collections.museum.ucsb.edu/files/original/213fe0a435de33ed65f6b622a9a12c63.jpg,"Physical Object",<strong>Paintings</strong>,1,0
"<strong>SPONSEL</strong>, Robert",<em>Untitled</em>,1965,"<strong>SPONSEL</strong>, Robert",,1965.103,,,,,,,,,,,,,,,,,,,,,,,,,,,,,,,,,,,,,,,,,,,,,,,"Physical Object",<strong>Paintings</strong>,1,0
"<strong>SPENCE</strong>, Andrew","<em>Goggles 2</em>",1995,"<strong>SPENCE</strong>, Andrew","Gift of the artist",2014.005.001,,,,,,,,,,,,,,,,,,,,,,,,,,,,,,,,,,,,,,,,,,,,,"abstract,Black,goggles,Painting,red,White",http://art-collections.museum.ucsb.edu/files/original/7274a9369f535d691c87040cab260445.jpg,"Physical Object",<strong>Paintings</strong>,1,0
"<strong>SPAULDING</strong>, Selden",<em>Composition</em>,1973,"<strong>SPAULDING</strong>, Selden","Gift of Katharine W. Tremaine in memory of Diana Tremaine McGowan",1985.99,,,,,,,,,,,,,,,,,,,,,,,,,,,,,,,,,,,,,,,,,,,,,"abstract,Blue,canvas,oil,Painting,White",http://art-collections.museum.ucsb.edu/files/original/4233eed509795fbb1c2b667a09f3918c.jpg,"Physical Object",<strong>Paintings</strong>,1,0
"<strong>SOYER</strong>, Moses","<em>Thoughtful Nude</em>","ca. 1970","<strong>SOYER</strong>, Moses","Gift of David and Jane Soyer",1989.6,,,,,,,,,,,,,,,,,,,,,,,,,,,,,,,,,,,,,,,,,,,,,"canvas,nude,oil,Painting,portrait,woman",http://art-collections.museum.ucsb.edu/files/original/a161c3a5a9105fa00ee478537ac285db.JPG,"Physical Object",<strong>Paintings</strong>,1,0
"<strong>SONSINI</strong>, John","<em>Augustin from the Santa Barbara Project</em>",2007,"<strong>SONSINI</strong>, John","Gift of John Sonsini",2018.009.005,,,,,,,,,,,,,,,,,,,,,,,,,,,,,,,,,,,,,,,,,,,,,"Male,man,Painting,person,portrait",http://art-collections.museum.ucsb.edu/files/original/187c64bd8700fc2f4fed570031809d36.jpg,"Physical Object",<strong>Paintings</strong>,1,0
"<strong>SONSINI</strong>, John","<em>Trinidad from the Santa Barbara Project</em>",2007,"<strong>SONSINI</strong>, John","Gift of John Sonsini",2018.009.004,,,,,,,,,,,,,,,,,,,,,,,,,,,,,,,,,,,,,,,,,,,,,"Male,man,Painting,person,portrait",http://art-collections.museum.ucsb.edu/files/original/5ae4ec7715d7275def966eb1ee3d56f8.jpg,"Physical Object",<strong>Paintings</strong>,1,0
"<strong>SONSINI</strong>, John","<em>Moises from the Santa Barbara Project</em>",2007,"<strong>SONSINI</strong>, John","Gift of John Sonsini",2018.009.003,,,,,,,,,,,,,,,,,,,,,,,,,,,,,,,,,,,,,,,,,,,,,,http://art-collections.museum.ucsb.edu/files/original/8568935ca34e8fe4da3ebc773680ae72.jpg,"Physical Object",<strong>Paintings</strong>,1,0
"<strong>SONSINI</strong>, John","<em>Pedro from the Santa Barbara Project</em>",2007,"<strong>SONSINI</strong>, John","Gift of John Sonsini",2018.009.002,,,,,,,,,,,,,,,,,,,,,,,,,,,,,,,,,,,,,,,,,,,,,"Male,man,Painting,person,portrait","http://art-collections.museum.ucsb.edu/files/original/2c654bf1b71197fdab09afe55543948e.jpg,http://art-collections.museum.ucsb.edu/files/original/36d0bd7481f6543da3254a26cffd26ee.jpg","Physical Object",<strong>Paintings</strong>,1,0
"<strong>SONSINI</strong>, John","<em>Miguel from the Santa Barbara Project</em>",2007,"<strong>SONSINI</strong>, John","Gift of John Sonsini",2018.009.001,,,,,,,,,,,,,,,,,,,,,,,,,,,,,,,,,,,,,,,,,,,,,"Male,man,Painting,person,portrait","http://art-collections.museum.ucsb.edu/files/original/a5ca8a00a1b3178ad3c6f6e5b3456ae4.jpg,http://art-collections.museum.ucsb.edu/files/original/f58db628427172d04180409185e0dfab.jpg","Physical Object",<strong>Paintings</strong>,1,0
"<strong>SODERBURG</strong>, Audrey","<em>Kern River #12</em>",1969,"<strong>SODERBURG</strong>, Audrey","Gift of the Artist",1983.24,,,,,,,,,,,,,,,,,,,,,,,,,,,,,,,,,,,,,,,,,,,,,,,"Physical Object",<strong>Paintings</strong>,1,0
"<strong>SMITH</strong>, Jim","<em>Portrait of Fran</em>","ca. 1990","<strong>SMITH</strong>, Jim","Estate of Frances Garvin and Keith Julius Puccinelli",2018.001.087,,,,,,,,,,,,,,,,,,,,,,,,,,,,,,,,,,,,,,,,,,,,,"Black,blonde,brown,Painting,portrait,woman",http://art-collections.museum.ucsb.edu/files/original/25fffaa813a7fd3c5a9b79a8a6113955.jpg,"Physical Object",<strong>Paintings</strong>,1,0
"<strong>SMITH</strong>, Hassel",<em>Composition</em>,1960,"<strong>SMITH</strong>, Hassel","Gift of David Kluger in memory of Martha Jackson",1969.22,,,,,,,,,,,,,,,,,,,,,,,,,,,,,,,,,,,,,,,,,,,,,"20th century,abstract,canvas,oil,Painting",http://art-collections.museum.ucsb.edu/files/original/db08375c62a00dba7ba3362d7f403a3f.jpg,"Physical Object",<strong>Paintings</strong>,1,0
"<strong>SICARD</strong>, Pierre","<em>L'Isle de la Cite'</em>","20th C.","<strong>SICARD</strong>, Pierre","Gift of Mrs. H. W. Armstrong to the Ala Story Print Collection",1967.75,,,,,,,,,,,,,,,,,,,,,,,,,,,,,,,,,,,,,,,,,,,,,,,"Physical Object",<strong>Paintings</strong>,1,0
"<strong>SHERWOOD</strong>, Katherine",<em>Specterrama</em>,1999,"<strong>SHERWOOD,</strong> Katherine","Gift of Stephanie Tilenius",2013.013.001,,,,,,,,,,,,,,,,,,,,,,,,,,,,,,,,,,,,,,,,,,,,,,,"Physical Object",<strong>Paintings</strong>,1,0
"<strong>SHAW</strong>, Jim","<em>A Quiet Place in the Country</em>",1992,"<strong>SHAW</strong>, Jim","Gift of Barry Sloane",1999.218,,,,,,,,,,,,,,,,,,,,,,,,,,,,,,,,,,,,,,,,,,,,,,,"Physical Object",<strong>Paintings</strong>,1,0
"<strong>SHAFFER</strong>, Richard","<em>Mirror, Sofa, Figure</em>",1979,"<strong>SHAFFER</strong>, Richard","Gift of Priscilla K. Giesen",1991.99,,,,,,,,,,,,,,,,,,,,,,,,,,,,,,,,,,,,,,,,,,,,,,,"Physical Object",<strong>Paintings</strong>,1,0
"<strong>SERGER</strong>, Frederich","<em>Young Girl with Yellow Hat</em>","20th C.","<strong>SERGER</strong>, Frederich","Gift of Mrs. Kay Hillman through UCSB Art Affiliates",1972.177,,,,,,,,,,,,,,,,,,,,,,,,,,,,,,,,,,,,,,,,,,,,,,,"Physical Object",<strong>Paintings</strong>,1,0
"<strong>SERBAN</strong>, Savu","<em>The Bathers</em>",2010,"<strong>SERBAN</strong>, Savu","Gift of Stanley and Gail Hollander",2016.003.007,,,,,,,,,,,,,,,,,,,,,,,,,,,,,,,,,,,,,,,,,,,,,"bathers,landscape,men,oil,Painting,still life",http://art-collections.museum.ucsb.edu/files/original/db327d53e2b857cfee733313282e7821.jpg,"Physical Object",<strong>Paintings</strong>,1,0
"<strong>SELIGER</strong>, Charles",<em>Heather</em>,1958,"<strong>SELIGER</strong>, Charles","Gift of Mr. and Mrs. Justin S. Ebersman",1985.108,,,,,,,,,,,,,,,,,,,,,,,,,,,,,,,,,,,,,,,,,,,,,"abstract,canvas,Figurative,oil,Painting",http://art-collections.museum.ucsb.edu/files/original/a4412322a6c33e730449d4855e95e92b.JPG,"Physical Object",<strong>Paintings</strong>,1,0
"<strong>SCHAFFNER</strong>, Ruth",<em>Untitled</em>,1970,"<strong>SCHAFFNER</strong>, Ruth","Gift of Pal C. Mills in memory of Jan Mills and Gail Berkus",2002.003.001,,,,,,,,,,,,,,,,,,,,,,,,,,,,,,,,,,,,,,,,,,,,,"abstract,colorful,gouache,Mixed Media,oil,Painting",http://art-collections.museum.ucsb.edu/files/original/1ca117c611870614ed25bb239c577522.jpg,"Physical Object",<strong>Paintings</strong>,1,0
"<strong>SANCHEZ</strong>, Stephanie","<em>Two Female Nudes-One Reclining (After Thomas Eakins)</em>",n.d.,"<strong>SANCHEZ</strong>, Stephanie","Gift of Lillian and Jon Lovelace",2010.001.007,,,,,,,,,,,,,,,,,,,,,,,,,,,,,,,,,,,,,,,,,,,,,"nude,Painting,portrait,red,women",http://art-collections.museum.ucsb.edu/files/original/342bf10edb50dd2d2b5feb6bcd367455.jpg,"Physical Object",<strong>Paintings</strong>,1,0
"<strong>SANCHEZ</strong>, Stephanie","<em>Railroad Yards - Early Morning</em>",1989,"<strong>SANCHEZ</strong>, Stephanie","Gift of Lillian and Jon Lovelace",2010.001.006,,,,,,,,,,,,,,,,,,,,,,,,,,,,,,,,,,,,,,,,,,,,,"abstract,architecture,bridge,grey,Painting,underpass",http://art-collections.museum.ucsb.edu/files/original/753a6c6555a2c1748bdc9382640afb57.jpg,"Physical Object",<strong>Paintings</strong>,1,0
"<strong>SAINTE</strong> <strong>JAMES</strong>, Alan",<em>Boot</em>,1990,"<strong>SAINTE JAMES</strong>, Alan","Estate of Frances Garvin and Keith Julius Puccinelli",2018.001.085,,,,,,,,,,,,,,,,,,,,,,,,,,,,,,,,,,,,,,,,,,,,,"Christ,Figurative,painitng,plywood,Religious",http://art-collections.museum.ucsb.edu/files/original/86c71b2cbc104a5b4b5d62e5f7c4bf60.jpg,"Physical Object",<strong>Paintings</strong>,1,0
"<strong>SAAR</strong>, Alison","<em>Slo' Pickin' Blues</em>",1988,"<strong>SAAR</strong>, Alison","Gift of Robert and Mary Looker",1998.6,,,,,,,,,,,,,,,,,,,,,,,,,,,,,,,,,,,,,,,,,,,,,"Black,guitar,man,oil,Painting,portrait",http://art-collections.museum.ucsb.edu/files/original/052aa3204558a1c5cc2298abf1e91bf0.jpg,"Physical Object",<strong>Paintings</strong>,1,0
"<strong>ROSS</strong>, Adam","<em>In an Indeterminate Place #2</em>",2012,"<strong>ROSS</strong>, Adam","Gift of the Artist",2013.006.001,,,,,,,,,,,,,,,,,,,,,,,,,,,,,,,,,,,,,,,,,,,,,,,"Physical Object",<strong>Paintings</strong>,1,0
"<strong>ROSS</strong>, Adam","<em>Untitled (The ideal Crash 3)</em>",2006,"<strong>ROSS</strong>, Adam","Gift of Laurence Eisenstein and Robin Zimelman",2018.024.003,,,,,,,,,,,,,,,,,,,,,,,,,,,,,,,,,,,,,,,,,,,,,"abstract,acrylic,city,oil,Painting,skyline",http://art-collections.museum.ucsb.edu/files/original/05507835b12674a26caf4b5799baeecf.jpg,"Physical Object",<strong>Paintings</strong>,1,0
"<strong>ROSALES</strong>, Harmonia","<em>Oshosi Gets his Crown</em>, 2019",2019,"<strong>ROSALES</strong>, Harmonia<br /><br />b. United States, 1984","Smith Family Art Collection",2022.006.001,,,,,,,,,,,,,,,,,,,,,,,,,,,,,,,,,,,,,,,,,,,,,"animal,Figurative,landscape,Male,Painting",http://art-collections.museum.ucsb.edu/files/original/a2cb9d9a09ae80c2a583d267cb863e92.jpg,,<strong>Paintings</strong>,1,0
"<strong>ROJAS</strong>, Clare",<em>Untitled</em>,2007,"<strong>ROJAS</strong>, Clare","Gift of Stanley and Gail Hollander",2016.003.006,,,,,,,,,,,,,,,,,,,,,,,,,,,,,,,,,,,,,,,,,,,,,"latex,orange,Painting,portrait,woman,Wood",http://art-collections.museum.ucsb.edu/files/original/e11ed37a34989366806d2235160ab3e3.jpg,"Physical Object",<strong>Paintings</strong>,1,0
"<strong>ROJAS</strong>, Clare",<em>Untitled</em>,2007,"<strong>ROJAS</strong>, Clare","Gift of Stanley and Gail Hollander",2016.003.005,,,,,,,,,,,,,,,,,,,,,,,,,,,,,,,,,,,,,,,,,,,,,"Figurative,gouache,latex,Painting,wood panel",http://art-collections.museum.ucsb.edu/files/original/219518147a277e168afbb6788ba1416f.jpg,"Physical Object",<strong>Paintings</strong>,1,0
"<strong>ROBERT</strong> Stacy-Judd","<em>On Guard</em>",1908,"<strong>ROBERT</strong> Stacy-Judd","Gift of the Artist",1973.95,,,,,,,,,,,,,,,,,,,,,,,,,,,,,,,,,,,,,,,,,,,,,"20th century,Blue,guard,Mixed Media,Painting,portrait,Spanish",http://art-collections.museum.ucsb.edu/files/original/6fdfb06022f593517adaeb9822ea6420.jpg,"Physical Object",<strong>Paintings</strong>,1,0
"<strong>RITTER</strong>, Julian",<em>Evolution</em>,n.d.,"<strong>RITTER</strong>, Julian","Gift of Harvey Taylor",1972.74,,,,,,,,,,,,,,,,,,,,,,,,,,,,,,,,,,,,,,,,,,,,,,,"Physical Object",<strong>Paintings</strong>,1,0
"<strong>POTTER</strong>, Carter","<em>Pure Painted Leader (Day-Glo Yellow Matte)</em>",1994,"<strong>POTTER</strong>, Carter","MUSEUM PURCHASE",1997.41,,,,,,,,,,,,,,,,,,,,,,,,,,,,,,,,,,,,,,,,,,,,,"35mm,abstract,glo,glow paint,matte paint,Yellow",http://art-collections.museum.ucsb.edu/files/original/7dc6cbb60f5b32d47d1ba5a2fefef502.jpg,"Physical Object",<strong>Paintings</strong>,1,0
"<strong>PITCHER,</strong> Hank","<em>Magic Forest, Scrub Jay, </em>2003",2003,"<strong>Pitcher</strong>, Hank","Gift of Melville and Irene Sayhun",2023.001.001,,,,,,,,,,,,,,,,,,,,,,,,,,,,,,,,,,,,,,,,,,,,,,http://art-collections.museum.ucsb.edu/files/original/29de236b467a56e84c0171b9ecf5f872.jpg,,<strong>Paintings</strong>,1,0
"<strong>PETERSON</strong>, Tenhold",<em>Untitled</em>,n.d.,"<strong>PETERSON</strong>, Tenhold",,L.1976.7,,,,,,,,,,,,,,,,,,,,,,,,,,,,,,,,,,,,,,,,,,,,,,,"Physical Object",<strong>Paintings</strong>,1,0
"<strong>PETERSON</strong>, Eric",<em>Untitled</em>,1964,"<strong>PETERSON</strong>, Eric",,1964.942,,,,,,,,,,,,,,,,,,,,,,,,,,,,,,,,,,,,,,,,,,,,,,,"Physical Object",<strong>Paintings</strong>,1,0
"<strong>PERZYNSKI</strong>, Bogdan","<em>No After Knowledge</em>",1985,"<strong>PERZYNSKI</strong>, Bogdan","Gift of Robert and Mary Looker",1998.7,,,,,,,,,,,,,,,,,,,,,,,,,,,,,,,,,,,,,,,,,,,,,"abstract,ladder,Painting,polish,Text",http://art-collections.museum.ucsb.edu/files/original/19a947fbab29b32b6ef1a4a60481abad.jpg,"Physical Object",<strong>Paintings</strong>,1,0
"<strong>PERKINS</strong>, Benjamin Franklin","<em>Unknown Title (Calendar)</em>",n.d.,"<strong>PERKINS</strong>, Benjamin Franklin","Estate of Frances Garvin and Keith Julius Puccinelli",2018.001.079,,,,,,,,,,,,,,,,,,,,,,,,,,,,,,,,,,,,,,,,,,,,,,,"Physical Object",<strong>Paintings</strong>,1,0
"<strong>PALTHE</strong>, Gerard Jan",<em>[Untitled]</em>,1732,"<strong>PALTHE</strong>, Gerard Jan","Bequest of Georgiana S. Kirkbride",1969.36,,,,,,,,,,,,,,,,,,,,,,,,,,,,,,,,,,,,,,,,,,,,,,,"Physical Object",<strong>Paintings</strong>,1,0
"<strong>OURSLER</strong>, Tony",<em>Untitled</em>,1999,"<strong>OURSLER</strong>, Tony","Gift of Margo Leavin",2014.019.007,,,,,,,,,,,,,,,,,,,,,,,,,,,,,,,,,,,,,,,,,,,,,"abstract,acrylic,geometric,Painting,purple",http://art-collections.museum.ucsb.edu/files/original/0e686598f5cb1523b1bca896dbf5aacb.jpg,"Physical Object",<strong>Paintings</strong>,1,0
"<strong>OLSEN</strong>, Scott",<em>Untitled</em>,2008,"<strong>OLSEN</strong>, Scott","Gift of Marc Selwyn Fine Art, Beverly Hills",2018.017.021,,,,,,,,,,,,,,,,,,,,,,,,,,,,,,,,,,,,,,,,,,,,,"abstract,Blue,linen,oil,Painting,triangular",http://art-collections.museum.ucsb.edu/files/original/c8c8f40f99456481039f9a3fc3839fe2.JPG,"Physical Object",<strong>Paintings</strong>,1,0
"<strong>NORTHERN ITALIAN</strong>","<em>Ecce Homo</em>","probably 17th - 18th C.","<strong>NORTHERN ITALIAN</strong>","Gift of Mr. Granville Libby",1964.187,,,,,,,,,,,,,,,,,,,,,,,,,,,,,,,,,,,,,,,,,,,,,,,"Physical Object",<strong>Paintings</strong>,1,0