﻿"Dublin Core:Title","Dublin Core:Description","Dublin Core:Date","Dublin Core:Creator","Dublin Core:Source","Dublin Core:Identifier","Dublin Core:Contributor","Dublin Core:Rights","Dublin Core:Relation","Dublin Core:Format","Dublin Core:Language","Dublin Core:Type","Dublin Core:Coverage","Dublin Core:Subject","Dublin Core:Publisher","Item Type Metadata:Birth Date","Item Type Metadata:Birthplace","Item Type Metadata:Event Type","Item Type Metadata:Participants","Item Type Metadata:URL","Item Type Metadata:Death Date","Item Type Metadata:Occupation","Item Type Metadata:Biographical Text","Item Type Metadata:Bibliography","Item Type Metadata:File name","Item Type Metadata:Time Summary","Item Type Metadata:Interviewer","Item Type Metadata:Interviewee","Item Type Metadata:Location","Item Type Metadata:Transcription","Item Type Metadata:Local URL","Item Type Metadata:Original Format","Item Type Metadata:Physical Dimensions","Item Type Metadata:Duration","Item Type Metadata:Compression","Item Type Metadata:Producer","Item Type Metadata:Director","Item Type Metadata:Bit Rate/Frequency","Item Type Metadata:Text","Item Type Metadata:Email Body","Item Type Metadata:Subject Line","Item Type Metadata:From","Item Type Metadata:To","Item Type Metadata:CC","Item Type Metadata:BCC","Item Type Metadata:Number of Attachments","Item Type Metadata:Standards","Item Type Metadata:Objectives","Item Type Metadata:Materials","Item Type Metadata:Tags",tags,file,itemType,collection,public,featured
"<strong>Mexico, Guanajuato, Chupicuaro</strong>","<em>Female figurine with slat eyes</em>","800 BCE-200 CE","<strong>Mexico, Guanajuato, Chupicuaro</strong>","Caroline Tarbell Tupper Collection of Pre-Columbian Art",2017.015.004,,,,,,,,,,,,,,,,,,,,,,,,,,,,,,,,,,,,,,,,,,,,,Pre-Columbian,"http://art-collections.museum.ucsb.edu/files/original/38e92067060373a7d0aeffa10678cf60.jpg,http://art-collections.museum.ucsb.edu/files/original/365204c05c0808a0593e0646984a0c57.jpg","Physical Object","<strong>The Arts of Ancient Mesoamerica</strong>",1,0
"<strong>Mexico, Guanajuato, Chupicuaro</strong>","<em>Female figurine with slat eyes</em>","800 BCE-200 CE","<strong>Mexico, Guanajuato, Chupicuaro</strong>","Caroline Tarbell Tupper Collection of Pre-Columbian Art",2017.015.002,,,,,,,,,,,,,,,,,,,,,,,,,,,,,,,,,,,,,,,,,,,,,Pre-Columbian,http://art-collections.museum.ucsb.edu/files/original/3f5a60ee8d1efa33c29be25e649d32e4.jpg,"Physical Object","<strong>The Arts of Ancient Mesoamerica</strong>",1,0
"<strong>Mexico, Guanajuato, Chupicuaro</strong>","<em>Female figurine wearing large hat with ball</em>","800 BCE-200 CE","<strong>Mexico, Guanajuato, Chupicuaro</strong>","Caroline Tarbell Tupper Collection of Pre-Columbian Art",2017.015.005,,,,,,,,,,,,,,,,,,,,,,,,,,,,,,,,,,,,,,,,,,,,,Pre-Columbian,http://art-collections.museum.ucsb.edu/files/original/39f7b7088bcc5da03d1019ea1171c34b.jpg,"Physical Object","<strong>The Arts of Ancient Mesoamerica</strong>",1,0
"<strong>Mexico, Guanajuato, Chupicuaro</strong>","<em>Female figure with slat eyes</em>","800 BCE-200 CE","<strong>Mexico, Guanajuato, Chupicuaro</strong>","Caroline Tarbell Tupper Collection of Pre-Columbian Art",2017.015.003,,,,,,,,,,,,,,,,,,,,,,,,,,,,,,,,,,,,,,,,,,,,,Pre-Columbian,http://art-collections.museum.ucsb.edu/files/original/a6a6e40532521937231ac9560a07ea83.jpg,"Physical Object","<strong>The Arts of Ancient Mesoamerica</strong>",1,0
"<strong>West Mexico, Colima</strong>","<em>Female figure</em>","300 BCE -300 CE","<strong>West Mexico, Colima</strong>","Caroline Tarbell Tupper Collection of Pre-Columbian Art",2018.015.005,,,,,,,,,,,,,,,,,,,,,,,,,,,,,,,,,,,,,,,,,,,,,Pre-Columbian,http://art-collections.museum.ucsb.edu/files/original/b64a07aab263c6ac2d7f21bb67fc4ea5.jpg,"Physical Object","<strong>The Arts of Ancient Mesoamerica</strong>",1,0
"<strong>Mexico; Central Veracruz, Remojades area</strong>","<em>Female figure</em>","ca. 1500 BCE - 1519 CE","<strong>Mexico; Central Veracruz, Remojades area</strong>","Caroline Tarbell Tupper Collection of Pre-Columbian Art",1986.403,,,,,,,,,,,,,,,,,,,,,,,,,,,,,,,,,,,,,,,,,,,,,Pre-Columbian,http://art-collections.museum.ucsb.edu/files/original/498def5a60bdc4c5a7e9d3ee7da69f19.jpg,"Physical Object","<strong>The Arts of Ancient Mesoamerica</strong>",1,0
"<strong>Mexico, Chipicuaro</strong>","<em>Female Figure</em>","300-500 CE","<strong>Mexico, Chipicuaro</strong>","Caroline Tarbell Tupper Collection of Pre-Columbian Art",1999.196,,,,,,,,,,,,,,,,,,,,,,,,,,,,,,,,,,,,,,,,,,,,,Pre-Columbian,http://art-collections.museum.ucsb.edu/files/original/99fa1eda2d81dbc88fd245efcac853a4.jpg,"Physical Object","<strong>The Arts of Ancient Mesoamerica</strong>",1,0
"<strong>SE Mexico, Totonaca people</strong>","<em>Face: wrinkled old man</em>","15th C.","<strong>SE Mexico, Totonaca people</strong>","Caroline Tarbell Tupper Collection of Pre-Columbian Art",2017.015.001,,,,,,,,,,,,,,,,,,,,,,,,,,,,,,,,,,,,,,,,,,,,,Pre-Columbian,http://art-collections.museum.ucsb.edu/files/original/ab71312f62849bcca3f2c258afb04e9a.jpg,"Physical Object","<strong>The Arts of Ancient Mesoamerica</strong>",1,0
"<strong>West Mexico, Costa Grande, Guerrero</strong>",<em>Face/Head</em>,"ca. 300 BCE - 300 CE","<strong>West Mexico, Costa Grande, Guerrero</strong>","Caroline Tarbell Tupper Collection of Pre-Columbian Art",1988.402,,,,,,,,,,,,,,,,,,,,,,,,,,,,,,,,,,,,,,,,,,,,,Pre-Columbian,http://art-collections.museum.ucsb.edu/files/original/428be604cbd5f5ea9b50fd54999edfce.jpg,"Physical Object","<strong>The Arts of Ancient Mesoamerica</strong>",1,0
"<strong>West Mexico, Mezcala</strong>","<em>Face Pendant</em>","ca. 300 BCE - 300 CE","<strong>West Mexico, Mezcala</strong>","Caroline Tarbell Tupper Collection of Pre-Columbian Art",1988.401,,,,,,,,,,,,,,,,,,,,,,,,,,,,,,,,,,,,,,,,,,,,,Pre-Columbian,http://art-collections.museum.ucsb.edu/files/original/bc45936cc6abb4fd3725491c89876308.jpg,"Physical Object","<strong>The Arts of Ancient Mesoamerica</strong>",1,0
"<strong>Mexico; Central Veracruz, Remojades area</strong>","<em>Face Pendant</em>","ca. 1500 BCE - 1519 CE","<strong>Mexico; Central Veracruz, Remojades area</strong>","Incoming Loan, Los Angeles County Museum of Art Gift of Constance McCormick Fearing",L2010.001.137,,,,,,,,,,,,,,,,,,,,,,,,,,,,,,,,,,,,,,,,,,,,,Pre-Columbian,http://art-collections.museum.ucsb.edu/files/original/cbb10798f26165c12fc64628ebe33773.jpg,"Physical Object","<strong>The Arts of Ancient Mesoamerica</strong>",1,0
"<strong>Mexico; Central Veracruz, Remojades area</strong>","<em>Face Pendant</em>","ca. 1500 BCE - 1519 CE","<strong>Mexico; Central Veracruz, Remojades area</strong>","Incoming Loan, Los Angeles County Museum of Art Gift of Constance McCormick Fearing",L2010.001.136,,,,,,,,,,,,,,,,,,,,,,,,,,,,,,,,,,,,,,,,,,,,,Pre-Columbian,http://art-collections.museum.ucsb.edu/files/original/d0466d62578e53e71fd5ac9a35abcdcf.jpg,"Physical Object","<strong>The Arts of Ancient Mesoamerica</strong>",1,0
"<strong>Mexico; Central Veracruz, Remojades area</strong>","<em>Face Pendant</em>","ca. 1500 BCE - 1519 CE","<strong>Mexico; Central Veracruz, Remojades area</strong>","Incoming Loan, Los Angeles County Museum of Art Gift of Constance McCormick Fearing",L2010.001.132,,,,,,,,,,,,,,,,,,,,,,,,,,,,,,,,,,,,,,,,,,,,,Pre-Columbian,http://art-collections.museum.ucsb.edu/files/original/77e5bdab7b3dba86acc44db8780b30bd.jpg,"Physical Object","<strong>The Arts of Ancient Mesoamerica</strong>",1,0
"<strong>West Mexico, Mezcala</strong>",<em>Face</em>,"ca. 300 BCE - 300 CE","<strong>West Mexico, Mezcala</strong>","Caroline Tarbell Tupper Collection of Pre-Columbian Art",1988.398,,,,,,,,,,,,,,,,,,,,,,,,,,,,,,,,,,,,,,,,,,,,,Pre-Columbian,http://art-collections.museum.ucsb.edu/files/original/0dfb7909571c728e80f5e5942a86c5c0.jpg,"Physical Object","<strong>The Arts of Ancient Mesoamerica</strong>",1,0
"<strong>Mexico; Central Veracruz, Remojades area</strong>",<em>Face</em>,"ca. 1500 BCE - 1519 CE","<strong>Mexico; Central Veracruz, Remojades area</strong>","Incoming Loan, Los Angeles County Museum of Art Gift of Constance McCormick Fearing",L2010.001.125,,,,,,,,,,,,,,,,,,,,,,,,,,,,,,,,,,,,,,,,,,,,,Pre-Columbian,http://art-collections.museum.ucsb.edu/files/original/1cc2db76c64dab89fd94a79a7c69dfe0.jpg,"Physical Object","<strong>The Arts of Ancient Mesoamerica</strong>",1,0
"<strong>Mexico; Central Veracruz, Remojades area</strong>",<em>Face</em>,"ca. 1500 BCE - 1519 CE","<strong>Mexico; Central Veracruz, Remojades area</strong>","Incoming Loan, Los Angeles County Museum of Art Gift of Constance McCormick Fearing",L2010.001.113,,,,,,,,,,,,,,,,,,,,,,,,,,,,,,,,,,,,,,,,,,,,,Pre-Columbian,http://art-collections.museum.ucsb.edu/files/original/0e3e44cc3a514f776f123b1519fb8782.jpg,"Physical Object","<strong>The Arts of Ancient Mesoamerica</strong>",1,0
"<strong>Mexico, Teotihuacan</strong>",<em>Face</em>,"ca. 250 - 700 CE","<strong>Mexico, Teotihuacan</strong>","Incoming Loan, Los Angeles County Museum of Art Gift of Constance McCormick Fearing",L2010.001.099,,,,,,,,,,,,,,,,,,,,,,,,,,,,,,,,,,,,,,,,,,,,,Pre-Columbian,http://art-collections.museum.ucsb.edu/files/original/1ccac854a2b840be69fc555bdfbac019.jpg,"Physical Object","<strong>The Arts of Ancient Mesoamerica</strong>",1,0
"<strong>West Mexico, Colima</strong>","<em>Erotic Colima ""Gingerbread"" Figure of a Man</em>","ca. 300 BCE - 300 CE","<strong>West Mexico, Colima</strong>",,1981.49,,,,,,,,,,,,,,,,,,,,,,,,,,,,,,,,,,,,,,,,,,,,,Pre-Columbian,http://art-collections.museum.ucsb.edu/files/original/745d2e3fa2523b72639c919ecc48f8af.JPG,"Physical Object","<strong>The Arts of Ancient Mesoamerica</strong>",1,0
"<strong>Mexico; Central Veracruz, Remojades area</strong>","<em>El Tejar</em>","ca. 200 BCE - 300 CE","<strong>Mexico; Central Veracruz, Remojades area</strong>","Incoming Loan, Los Angeles County Museum of Art Gift of Constance McCormick Fearing",L2010.001.155,,,,,,,,,,,,,,,,,,,,,,,,,,,,,,,,,,,,,,,,,,,,,Pre-Columbian,http://art-collections.museum.ucsb.edu/files/original/20b8e88f1bb608caec9570e352d344c3.jpg,"Physical Object","<strong>The Arts of Ancient Mesoamerica</strong>",1,0
"<strong>Mexico; Central Veracruz, Remojades area</strong>","<em>Ear Spool</em>","ca. 1500 BCE - 1519 CE","<strong>Mexico; Central Veracruz, Remojades area</strong>","Incoming Loan, Los Angeles County Museum of Art Gift of Constance McCormick Fearing",L2010.001.109,,,,,,,,,,,,,,,,,,,,,,,,,,,,,,,,,,,,,,,,,,,,,Pre-Columbian,http://art-collections.museum.ucsb.edu/files/original/7c25b74ae680cfe09d6f07cb7a7c21ea.jpg,"Physical Object","<strong>The Arts of Ancient Mesoamerica</strong>",1,0
"<strong>West Mexico, Mezcala</strong>","<em>Ear Spool</em>","ca. 300 BCE - 300 CE","<strong>West Mexico, Mezcala</strong>","Incoming Loan, Los Angeles County Museum of Art Gift of Constance McCormick Fearing",L2010.001.023,,,,,,,,,,,,,,,,,,,,,,,,,,,,,,,,,,,,,,,,,,,,,Pre-Columbian,"http://art-collections.museum.ucsb.edu/files/original/5104ceddecac6eb0db4fd70555566afb.jpg,http://art-collections.museum.ucsb.edu/files/original/fa6bd0a426768605dff2be0e981aad2a.jpg,http://art-collections.museum.ucsb.edu/files/original/b740fb54c178d3c3959a9cdfed796b5b.jpg,http://art-collections.museum.ucsb.edu/files/original/dd163af7c999916d77f0a34633744efd.jpg","Physical Object","<strong>The Arts of Ancient Mesoamerica</strong>",1,0
<strong>Panama</strong>,"<em>Eagle pendant</em>","ca. 800-1100 CE",<strong>Panama</strong>,"Gift of Alan and Carolyn Ferguson",1996.36,,,,,,,,,,,,,,,,,,,,,,,,,,,,,,,,,,,,,,,,,,,,,Pre-Columbian,http://art-collections.museum.ucsb.edu/files/original/1346aaf91155b19a9e6679e134ea3e19.jpg,"Physical Object","<strong>The Arts of Ancient Mesoamerica</strong>",1,0
"<strong>West Mexico, Colima</strong>","<em>Drinking vessel: dog</em>","300 BCE - 300 CE","<strong>West Mexico, Colima</strong>","Caroline Tarbell Tupper Collection of Pre-Columbian Art",2018.015.003,,,,,,,,,,,,,,,,,,,,,,,,,,,,,,,,,,,,,,,,,,,,,Pre-Columbian,http://art-collections.museum.ucsb.edu/files/original/62129ca2bc02eef848714c370b0a331f.jpg,"Physical Object","<strong>The Arts of Ancient Mesoamerica</strong>",1,0
"<strong>West Mexico, Colima</strong>","<em>Drinking vessel: dog</em>","300 BCE - 300 CE","<strong>West Mexico, Colima</strong>","Caroline Tarbell Tupper Collection of Pre-Columbian Art",2018.015.001,,,,,,,,,,,,,,,,,,,,,,,,,,,,,,,,,,,,,,,,,,,,,Pre-Columbian,http://art-collections.museum.ucsb.edu/files/original/eb0c7a2411b33047c105b6c5d308ee8a.jpg,"Physical Object","<strong>The Arts of Ancient Mesoamerica</strong>",1,0
Mexico,"Dress and shoes",n.d.,Mexico,"Gift of Mrs. MacKinley Helm in memory of Dr. MacKinley Helm",1963.193,,,,,,,,,,,,,,,,,,,,,,,,,,,,,,,,,,,,,,,,,,,,,Pre-Columbian,,"Physical Object","<strong>The Arts of Ancient Mesoamerica</strong>",1,0
"<strong>Mexico, Colima</strong>","<em>Double Flute</em>",n.d.,"<strong>Mexico, Colima</strong>","Caroline Tarbell Tupper Collection of Pre-Columbian Art",1999.212,,,,,,,,,,,,,,,,,,,,,,,,,,,,,,,,,,,,,,,,,,,,,Pre-Columbian,,"Physical Object","<strong>The Arts of Ancient Mesoamerica</strong>",1,0
"<strong>West Mexico, Colima</strong>","<em>Double Flute</em>","ca. 300 BCE - 300 CE","<strong>West Mexico, Colima</strong>","Caroline Tarbell Tupper Collection of Pre-Columbian Art",1999.198,,,,,,,,,,,,,,,,,,,,,,,,,,,,,,,,,,,,,,,,,,,,,Pre-Columbian,http://art-collections.museum.ucsb.edu/files/original/39a3a7dd0796b458caa43997b55baea5.jpg,"Physical Object","<strong>The Arts of Ancient Mesoamerica</strong>",1,0
"<strong>Mexico; Central Veracruz, Remojades area</strong>","<em>Dolphin Head</em>","ca. 1500 BCE - 1519 CE","<strong>Mexico; Central Veracruz, Remojades area</strong>",,1974.35,,,,,,,,,,,,,,,,,,,,,,,,,,,,,,,,,,,,,,,,,,,,,Pre-Columbian,http://art-collections.museum.ucsb.edu/files/original/eacc762b538962f4013ec283c3191866.jpg,"Physical Object","<strong>The Arts of Ancient Mesoamerica</strong>",1,0
"<strong>West Mexico, Colima</strong>","<em>Dog Pot</em>","ca. 300 BCE - 300 CE","<strong>West Mexico, Colima</strong>","Gift of Mrs. MacKinley Helm in memory of Dr. MacKinley Helm",1963.88,,,,,,,,,,,,,,,,,,,,,,,,,,,,,,,,,,,,,,,,,,,,,Pre-Columbian,http://art-collections.museum.ucsb.edu/files/original/4cab57acb5e0940eb4549fa3b9f1d9ab.jpg,"Physical Object","<strong>The Arts of Ancient Mesoamerica</strong>",1,0
"<strong>West Mexico, Colima</strong>","<em>Dog Ocarina</em>","ca. 300 BCE - 300 CE","<strong>West Mexico, Colima</strong>","Caroline Tarbell Tupper Collection of Pre-Columbian Art",1999.204,,,,,,,,,,,,,,,,,,,,,,,,,,,,,,,,,,,,,,,,,,,,,Pre-Columbian,http://art-collections.museum.ucsb.edu/files/original/93410d61135cc0e48fb2452902d233c3.jpg,"Physical Object","<strong>The Arts of Ancient Mesoamerica</strong>",1,0
"<strong>West Mexico, Nayarit</strong>",<em>Dog</em>,"ca. 300 BCE- 300 CE","<strong>West Mexico, Nayarit</strong>","Gift of Mrs. MacKinley Helm in memory of Dr. MacKinley Helm",1963.85,,,,,,,,,,,,,,,,,,,,,,,,,,,,,,,,,,,,,,,,,,,,,Pre-Columbian,http://art-collections.museum.ucsb.edu/files/original/5d1fb56d67e2b9596a148496b01d65a8.jpg,"Physical Object","<strong>The Arts of Ancient Mesoamerica</strong>",1,0
"<strong>West Mexico, Colima</strong>","<em>Dinking vessel: dog</em>","300 BCE - 300 CE","<strong>West Mexico, Colima</strong>","Caroline Tarbell Tupper Collection of Pre-Columbian Art",2018.015.002,,,,,,,,,,,,,,,,,,,,,,,,,,,,,,,,,,,,,,,,,,,,,Pre-Columbian,http://art-collections.museum.ucsb.edu/files/original/27dba5b0bf004fa8575bc82ef0c53845.jpg,"Physical Object","<strong>The Arts of Ancient Mesoamerica</strong>",1,0
"<strong>Mexico, Teotihuacan</strong>","<em>Dancing Figure</em>","ca. 250 - 700 CE","<strong>Mexico, Teotihuacan</strong>","Incoming Loan, Los Angeles County Museum of Art Gift of Constance McCormick Fearing",L2010.001.097,,,,,,,,,,,,,,,,,,,,,,,,,,,,,,,,,,,,,,,,,,,,,Pre-Columbian,http://art-collections.museum.ucsb.edu/files/original/876f56950bd67e6bf1c704d83a8318ab.jpg,"Physical Object","<strong>The Arts of Ancient Mesoamerica</strong>",1,0
"<strong>Mexico, Teotihuacan</strong>","<em>Dancing Figure</em>","ca. 250 - 700 CE","<strong>Mexico, Teotihuacan</strong>","Incoming Loan, Los Angeles County Museum of Art Gift of Constance McCormick Fearing",L2010.001.094,,,,,,,,,,,,,,,,,,,,,,,,,,,,,,,,,,,,,,,,,,,,,Pre-Columbian,http://art-collections.museum.ucsb.edu/files/original/4b1097e1e33882abe0406d79f3e24733.jpg,"Physical Object","<strong>The Arts of Ancient Mesoamerica</strong>",1,0
<b>Mexico</b>,<em>Cylinder</em>,n.d.,<strong>Mexico</strong>,"Caroline Tarbell Tupper Collection of Pre-Columbian Art",1999.148,,,,,,,,,,,,,,,,,,,,,,,,,,,,,,,,,,,,,,,,,,,,,Pre-Columbian,http://art-collections.museum.ucsb.edu/files/original/77b96d34cdae96680454bee3f47d7846.jpg,"Physical Object","<strong>The Arts of Ancient Mesoamerica</strong>",1,0
"<strong>Mexico, Maya</strong>","<em>Crouching Figure with Bowl Head</em>","ca. 1300 - 1500","<strong>Mexico, Maya</strong>","Incoming Loan, Los Angeles County Museum of Art Gift of Constance McCormick Fearing",L2010.001.007,,,,,,,,,,,,,,,,,,,,,,,,,,,,,,,,,,,,,,,,,,,,,Pre-Columbian,http://art-collections.museum.ucsb.edu/files/original/8de56ff148d24a000cae5da154cbd75f.jpg,"Physical Object","<strong>The Arts of Ancient Mesoamerica</strong>",1,0
<strong>Mexico</strong>,"<em>Copper Blade</em>",n.d.,<strong>Mexico</strong>,"Caroline Tarbell Tupper Collection of Pre-Columbian Art",1999.152.a-b,,,,,,,,,,,,,,,,,,,,,,,,,,,,,,,,,,,,,,,,,,,,,Pre-Columbian,"http://art-collections.museum.ucsb.edu/files/original/673b797ae82e6bda9a7481c06da8cec2.jpg,http://art-collections.museum.ucsb.edu/files/original/04504db3af8bdbecefbd1455655f06ec.jpg","Physical Object","<strong>The Arts of Ancient Mesoamerica</strong>",1,0
"<strong>Mexico, Maya</strong>","Copper Axe-Head","ca. 1200 - 1450","<strong>Mexico, Maya</strong>",,1981.45.b,,,,,,,,,,,,,,,,,,,,,,,,,,,,,,,,,,,,,,,,,,,,,Pre-Columbian,http://art-collections.museum.ucsb.edu/files/original/69bb60fe9befe8554c1a91e53c74f9df.jpg,"Physical Object","<strong>The Arts of Ancient Mesoamerica</strong>",1,0
"<strong>Mexico, Maya</strong>","<em>Copper Axe-Head</em>","ca. 1200 - 1450","<strong>Mexico, Maya</strong>",,"1981.45.a,b",,,,,,,,,,,,,,,,,,,,,,,,,,,,,,,,,,,,,,,,,,,,,Pre-Columbian,http://art-collections.museum.ucsb.edu/files/original/6279d56353c8831aa594325f04a4f9b4.jpg,"Physical Object","<strong>The Arts of Ancient Mesoamerica</strong>",1,0
"<strong>Ancient Mesoamerica</strong>","<em>Container with figure</em>",n.d.,"<strong>Ancient Mesoamerica</strong>","Found in the Collection",2016.001.001,,,,,,,,,,,,,,,,,,,,,,,,,,,,,,,,,,,,,,,,,,,,,Pre-Columbian,"http://art-collections.museum.ucsb.edu/files/original/055376308339dd1ad5d0a6d00377c09f.jpg,http://art-collections.museum.ucsb.edu/files/original/27131c325c5907894e7be975841f931a.jpg","Physical Object","<strong>The Arts of Ancient Mesoamerica</strong>",1,0
"<strong>Mexico, Guerrero</strong>","Conch Shell Trumpet",n.d.,"<strong>Mexico, Guerrero</strong>","Caroline Tarbell Tupper Collection of Pre-Columbian Art",1999.203,,,,,,,,,,,,,,,,,,,,,,,,,,,,,,,,,,,,,,,,,,,,,Pre-Columbian,,"Physical Object","<strong>The Arts of Ancient Mesoamerica</strong>",1,0
"<strong>Mexico, Guerrero</strong>","<em>Conch Shell Trumpet</em>",n.d.,"<strong>Mexico, Guerrero</strong>","Caroline Tarbell Tupper Collection of Pre-Columbian Art",1999.202,,,,,,,,,,,,,,,,,,,,,,,,,,,,,,,,,,,,,,,,,,,,,Pre-Columbian,http://art-collections.museum.ucsb.edu/files/original/070ebaad0618b01a9994feb865bc1531.JPG,"Physical Object","<strong>The Arts of Ancient Mesoamerica</strong>",1,0
"<strong>West Mexico, Colima</strong>","<em>Colima Vessel</em>","ca. 300 BCE - 300 CE","<strong>West Mexico, Colima</strong>",,1981.5,,,,,,,,,,,,,,,,,,,,,,,,,,,,,,,,,,,,,,,,,,,,,Pre-Columbian,http://art-collections.museum.ucsb.edu/files/original/3eb9f7704ba72f15d2e4525a2b82a535.jpg,"Physical Object","<strong>The Arts of Ancient Mesoamerica</strong>",1,0
"<strong>West Mexico, Colima</strong>","<em>Colima Dog Vessel</em>","ca. 300 BCE - 300 CE","<strong>West Mexico, Colima</strong>",,1981.40,,,,,,,,,,,,,,,,,,,,,,,,,,,,,,,,,,,,,,,,,,,,,Pre-Columbian,http://art-collections.museum.ucsb.edu/files/original/3bdd3a42a1b925fc92c3d33a284aaacb.jpg,"Physical Object","<strong>The Arts of Ancient Mesoamerica</strong>",1,0
"<strong>West Mexico, Colima</strong>","<em>Colima ""Gingerbread"" Unglazed Clay Figure of a Man</em>","ca. 300 BCE - 300 CE","<strong>West Mexico, Colima</strong>",,1981.48,,,,,,,,,,,,,,,,,,,,,,,,,,,,,,,,,,,,,,,,,,,,,Pre-Columbian,http://art-collections.museum.ucsb.edu/files/original/68f0ebc51fcf58e56b588a82d29d1c1d.jpg,"Physical Object","<strong>The Arts of Ancient Mesoamerica</strong>",1,0
"<strong>Mexico, Maya?</strong>","Coatlinchan (whorl)",n.d.,"<strong>Mexico, Maya?</strong>","Robert B. Stacy-Judd",1973.221,,,,,,,,,,,,,,,,,,,,,,,,,,,,,,,,,,,,,,,,,,,,,Pre-Columbian,http://art-collections.museum.ucsb.edu/files/original/40a6f52241d7fc59fdc0a6cad290f28a.jpg,"Physical Object","<strong>The Arts of Ancient Mesoamerica</strong>",1,0
"<strong>West Mexico, Nayarit</strong>","Cloaked Male Figure","ca. 300 BCE - 300 CE","<strong>West Mexico, Nayarit</strong>","Gift of Mrs. MacKinley Helm in memory of Dr. MacKinley Helm",1963.109,,,,,,,,,,,,,,,,,,,,,,,,,,,,,,,,,,,,,,,,,,,,,Pre-Columbian,,"Physical Object","<strong>The Arts of Ancient Mesoamerica</strong>",1,0
"<strong>Mexico; Central Veracruz, Remojades area</strong>","<em>Clay Mold for Head</em>","ca. 1500 BCE - 1519 CE","<strong>Mexico; Central Veracruz, Remojades area</strong>","Incoming Loan, Los Angeles County Museum of Art Gift of Constance McCormick Fearing",L2010.001.054,,,,,,,,,,,,,,,,,,,,,,,,,,,,,,,,,,,,,,,,,,,,,Pre-Columbian,http://art-collections.museum.ucsb.edu/files/original/aa8e199ba96ebe2f9dd476e05cc5a439.jpg,"Physical Object","<strong>The Arts of Ancient Mesoamerica</strong>",1,0
<strong>Mexico</strong>,"<em>Ceramic Vase-Jar</em>","ca. 1200-1532",<strong>Mexico</strong>,"Transfer, Santa Barbara Museum of Art, Gift of Marion Wilder",2018.016.025,,,,,,,,,,,,,,,,,,,,,,,,,,,,,,,,,,,,,,,,,,,,,Pre-Columbian,http://art-collections.museum.ucsb.edu/files/original/b03d02813c41bb32cae18380e7656d53.JPG,"Physical Object","<strong>The Arts of Ancient Mesoamerica</strong>",1,0
"<strong>Mexico, Teotinua</strong>","<em>Ceramic human head</em>","ca. 200 BCE","<strong>Mexico, Teotinua</strong>","Transfer, Santa Barbara Museum of Art, Gift of Mary and Leigh Block",2018.016.028,,,,,,,,,,,,,,,,,,,,,,,,,,,,,,,,,,,,,,,,,,,,,Pre-Columbian,http://art-collections.museum.ucsb.edu/files/original/b582e08efc8f13f4e50743d74ae0d853.JPG,"Physical Object","<strong>The Arts of Ancient Mesoamerica</strong>",1,0
<strong>Mexico</strong>,"<em>Ceramic human head</em>",n.d.,<strong>Mexico</strong>,"Transfer, Santa Barbara Museum of Art, Gift of Mary and Leigh Block",2018.016.027,,,,,,,,,,,,,,,,,,,,,,,,,,,,,,,,,,,,,,,,,,,,,Pre-Columbian,http://art-collections.museum.ucsb.edu/files/original/6aca375aff5316ebf576b8b7a7b2866a.JPG,"Physical Object","<strong>The Arts of Ancient Mesoamerica</strong>",1,0
<strong>Mexico</strong>,"<em>Ceramic human head</em>",n.d.,<strong>Mexico</strong>,"Transfer, Santa Barbara Museum of Art, Gift of Marion Wilder",2018.016.026,,,,,,,,,,,,,,,,,,,,,,,,,,,,,,,,,,,,,,,,,,,,,Pre-Columbian,http://art-collections.museum.ucsb.edu/files/original/db80405a5496e1b8af615933a7a279dd.JPG,"Physical Object","<strong>The Arts of Ancient Mesoamerica</strong>",1,0
"<strong>Mexico, Nazca</strong>","Ceramic bowl with spout",n.d.,"<strong>Mexico, Nazca</strong>","Transfer, Santa Barbara Museum of Art, Gift of Mr. and Mrs. Earnest C. Watson",2018.016.017,,,,,,,,,,,,,,,,,,,,,,,,,,,,,,,,,,,,,,,,,,,,,Pre-Columbian,http://art-collections.museum.ucsb.edu/files/original/9537940ee5568a414143b4b867573e97.jpg,"Physical Object","<strong>The Arts of Ancient Mesoamerica</strong>",1,0