﻿"Dublin Core:Title","Dublin Core:Description","Dublin Core:Date","Dublin Core:Creator","Dublin Core:Source","Dublin Core:Identifier","Dublin Core:Contributor","Dublin Core:Rights","Dublin Core:Relation","Dublin Core:Format","Dublin Core:Language","Dublin Core:Type","Dublin Core:Coverage","Dublin Core:Subject","Dublin Core:Publisher","Item Type Metadata:Birth Date","Item Type Metadata:Birthplace","Item Type Metadata:Event Type","Item Type Metadata:Participants","Item Type Metadata:URL","Item Type Metadata:Death Date","Item Type Metadata:Occupation","Item Type Metadata:Biographical Text","Item Type Metadata:Bibliography","Item Type Metadata:File name","Item Type Metadata:Time Summary","Item Type Metadata:Interviewer","Item Type Metadata:Interviewee","Item Type Metadata:Location","Item Type Metadata:Transcription","Item Type Metadata:Local URL","Item Type Metadata:Original Format","Item Type Metadata:Physical Dimensions","Item Type Metadata:Duration","Item Type Metadata:Compression","Item Type Metadata:Producer","Item Type Metadata:Director","Item Type Metadata:Bit Rate/Frequency","Item Type Metadata:Text","Item Type Metadata:Email Body","Item Type Metadata:Subject Line","Item Type Metadata:From","Item Type Metadata:To","Item Type Metadata:CC","Item Type Metadata:BCC","Item Type Metadata:Number of Attachments","Item Type Metadata:Standards","Item Type Metadata:Objectives","Item Type Metadata:Materials","Item Type Metadata:Tags",tags,file,itemType,collection,public,featured
"<strong>ZSISSLY</strong> (<strong>ALBRIGHT</strong>, Malvin Marr)",<em>Victoria</em>,1947,"<strong>ZSISSLY</strong> (<strong>ALBRIGHT</strong>, Malvin Marr)","Gift of Don Trevey to the Ken Trevey Collection of American Realist Prints",1992.174,,,,,,,,,,,,,,,,,,,,,,,,,,,,,,,,,,,,,,,,,,,,,"Figure,Lithograph,portrait,table,Works-on-Paper",http://art-collections.museum.ucsb.edu/files/original/6dbc93c7d1df89e89dfacbbc387e7f3d.jpg,"Physical Object","<strong>The Ken Trevey Collection of American Realist Prints</strong>",1,0
"<strong>PATIGIAN</strong>, Haig",<em>Industry</em>,1929,"<strong>PATIGIAN</strong>, Haig","Atlantic Richfield Company",1969.96,,,,,,,,,,,,,,,,,,,,,,,,,,,,,,,,,,,,,,,,,,,,,"Figurative,Figure,gilded,Sculpture,terracotta",http://art-collections.museum.ucsb.edu/files/original/8cab9ef4132bb641ca1b7824dc09d73a.jpg,"Physical Object","<strong>Outdoor Sculpture</strong>",1,0
"<strong>PATIGIAN</strong>, Haig",<em>Navigation</em>,1929,"<strong>PATIGIAN</strong>, Haig","Atlantic Richfield Company",1969.97,,,,,,,,,,,,,,,,,,,,,,,,,,,,,,,,,,,,,,,,,,,,,"Figurative,Figure,gilded,Sculpture,terracotta",http://art-collections.museum.ucsb.edu/files/original/b98e8f8d00dc9db08b4cfda0aed17284.jpg,"Physical Object","<strong>Outdoor Sculpture</strong>",1,0
"<strong>BRUCE HIGH QUALITY FOUNDATION</strong>","<em>Expose: Sometimes I Want to Kill the President</em>",2008,"<strong>BRUCE HIGH QUALITY FOUNDATION</strong>","Gift of Exit Art, New York",2012.009.005.003,,,,,,,,,,,,,,,,,,,,,,,,,,,,,,,,,,,,,,,,,,,,,"abstract,cigarette,Figure,President,Primary Colors,Speech,Text,Word-Bubble,Works-on-Paper",http://art-collections.museum.ucsb.edu/files/original/f1c8cddbaca6f1db1781290be14a1bfe.jpg,"Physical Object","<strong>EXIT ART</strong>",1,0
"<strong>WARSHAW</strong>, Howard","<em>Untitled (The E)</em>",n.d.,"<strong>WARSHAW</strong>, Howard","Found in the collection",2011.001.008,,,,,,,,,,,,,,,,,,,,,,,,,,,,,,,,,,,,,,,,,,,,,"abstract,etching,Figure,lines,Works-on-Paper",http://art-collections.museum.ucsb.edu/files/original/179f9421d4b3012fa17128f2059de442.jpg,"Physical Object","<strong>UCSB Alumni and Faculty</strong>",1,0
"<strong>WARSHAW</strong>, Howard","<em>Untitled (NY, NC, 85709510)</em>",n.d.,"<strong>WARSHAW</strong>, Howard","Found in the collection",2011.001.009,,,,,,,,,,,,,,,,,,,,,,,,,,,,,,,,,,,,,,,,,,,,,"abstract,etching,Figurative,Figure,Works-on-Paper",http://art-collections.museum.ucsb.edu/files/original/afccb72049d3c251435ebf83906a073b.jpg,"Physical Object","<strong>UCSB Alumni and Faculty</strong>",1,0
"<strong>WARSHAW</strong>, Howard","<em>Untitled (Box figure with outstretched hands, claws, and foot)</em>",n.d.,"<strong>WARSHAW</strong>, Howard","Found in the collection",2011.001.010,,,,,,,,,,,,,,,,,,,,,,,,,,,,,,,,,,,,,,,,,,,,,"abstract,box,etching,Figure,works on paper",http://art-collections.museum.ucsb.edu/files/original/420bc3b667e24b58a0b3cb919b7e47d5.jpg,"Physical Object","<strong>UCSB Alumni and Faculty</strong>",1,0
"<strong>WARSHAW</strong>, Howard",<em>Untitled</em>,"20th c.","<strong>WARSHAW,</strong> Howard","Gift of Professor Alfred Moir",1973.153,,,,,,,,,,,,,,,,,,,,,,,,,,,,,,,,,,,,,,,,,,,,,"etching,Figure,portrait,Seated,Works-on-Paper",http://art-collections.museum.ucsb.edu/files/original/a02b710d146263c41cc0616818d95714.jpg,"Physical Object","<strong>UCSB Alumni and Faculty</strong>",1,0
"<strong>WARSHAW</strong>, Howard",<em>Minotaur</em>,n.d.,"<strong>WARSHAW</strong>, Howard","Morse Bequest",1993.26,,,,,,,,,,,,,,,,,,,,,,,,,,,,,,,,,,,,,,,,,,,,,"animal,etching,Figure,portrait,Works-on-Paper",http://art-collections.museum.ucsb.edu/files/original/c822d0bfaa7ea8ba2bd4b4930a61acef.jpg,"Physical Object","<strong>UCSB Alumni and Faculty</strong>",1,0
"<strong>WARSHAW</strong>, Howard","<em>Seated figure from rear</em>",1964,"<strong>WARSHAW</strong>, Howard","Morse Bequest",1993.31,,,,,,,,,,,,,,,,,,,,,,,,,,,,,,,,,,,,,,,,,,,,,"etching,Figure,portrait,Seated,Works-on-Paper",http://art-collections.museum.ucsb.edu/files/original/d6c30d8bce87f88f598a8a0252988d65.jpg,"Physical Object","<strong>UCSB Alumni and Faculty</strong>",1,0
"<strong>WARSHAW</strong>, Howard","<em>Reclining figure</em>",1961,"<strong>WARSHAW</strong>, Howard",,1996.12,,,,,,,,,,,,,,,,,,,,,,,,,,,,,,,,,,,,,,,,,,,,,"Figure,Graphite,portrait,print,Works-on-Paper",http://art-collections.museum.ucsb.edu/files/original/67420b6c20c5eb57c07f5b0a1a5f4ee1.jpg,"Physical Object","<strong>UCSB Alumni and Faculty</strong>",1,0
"<strong>WARSHAW</strong>, Howard","<em>Reclining figure</em>",1964,"<strong>WARSHAW</strong>, Howard",,1996.13,,,,,,,,,,,,,,,,,,,,,,,,,,,,,,,,,,,,,,,,,,,,,"Figure,portrait,print,wash,Works-on-Paper",http://art-collections.museum.ucsb.edu/files/original/9fb8e5b51facd5366ef8dfd618316f4b.jpg,"Physical Object","<strong>UCSB Alumni and Faculty</strong>",1,0
"<strong>WARSHAW</strong>, Howard",Untitled,n.d.,"<strong>WARSHAW</strong>, Howard","Found in the Collection",2015.004.001,,,,,,,,,,,,,,,,,,,,,,,,,,,,,,,,,,,,,,,,,,,,,"color,Figurative,Figure,oil,Painting",http://art-collections.museum.ucsb.edu/files/original/9243f5b1a0100bd79b862015c931b7a7.jpg,"Physical Object","<strong>UCSB Alumni and Faculty</strong>",1,0
"<strong>Maker unknown, Phillipines</strong>",<em>Figure</em>,n.d.,"<strong>Maker unknown, Phillipines</strong>","Gift of Mrs. W.R. Maris",1963.60,,,,,,,,,,,,,,,,,,,,,,,,,,,,,,,,,,,,,,,,,,,,,"Figure,Male,Philippines,portrait,Sculpture,Wood",http://art-collections.museum.ucsb.edu/files/original/e24d3bf1bbe6d635bb5acf964476616c.jpg,"Physical Object","<strong>Oceanic Arts</strong>",1,0
"<strong>Maker unknown, Phillipines</strong>",<em>Figure</em>,n.d.,"<strong>Maker unknown, Phillipines</strong>","Gift of Mrs. W.R. Maris",1963.61,,,,,,,,,,,,,,,,,,,,,,,,,,,,,,,,,,,,,,,,,,,,,"Female,Figure,Philippines,portrait,Sculpture,Wood",http://art-collections.museum.ucsb.edu/files/original/7ca0a5240a36e35a9d4e8df3e0a74820.jpg,"Physical Object","<strong>Oceanic Arts</strong>",1,0
"<strong>MELLER</strong>, Peter","<em>Mona Lisa on an Outing</em>",1992,"Meller, Peter","Bea Farwell Bequest",2010.003.034,,,,,,,,,,,,,,,,,,,,,,,,,,,,,,,,,,,,,,,,,,,,,"black and white,Figure,landscape,Mountain,Works-on-Paper",http://art-collections.museum.ucsb.edu/files/original/fb0113c4dbb4899b571cab0be9b8c019.jpg,"Physical Object","<strong>UCSB Alumni and Faculty</strong>",1,0
"<strong>MELLER</strong>, Peter","<em>Ancient Romans Ploughing (Beatus Ille; version 2)</em>","ca. 1970-80s","Meller, Peter","Incoming loan, courtesy John Moore",IL2014.001.016,,,,,,,,,,,,,,,,,,,,,,,,,,,,,,,,,,,,,,,,,,,,,"animal,Figure,landscape,portrait,print,Works-on-Paper",http://art-collections.museum.ucsb.edu/files/original/3f0eaaaf4b5b67ad59fc13cc50c4727b.jpg,"Physical Object","<strong>UCSB Alumni and Faculty</strong>",1,0
"<strong>MELLER</strong>, Peter",<em>Narcissus</em>,"ca. 1970-80s","Meller, Peter","Incoming loan, courtesy John Moore",IL2014.001.017,,,,,,,,,,,,,,,,,,,,,,,,,,,,,,,,,,,,,,,,,,,,,"Figure,Ink,landscape,print,water,Works-on-Paper",http://art-collections.museum.ucsb.edu/files/original/229fe99622485a0b1977cb604189214a.jpg,"Physical Object","<strong>UCSB Alumni and Faculty</strong>",1,0
"<strong>MELLER</strong>, Peter",<em>Narcissus</em>,"ca. 1970-80s","Meller, Peter","Incoming loan, courtesy John Moore",IL2014.001.018,,,,,,,,,,,,,,,,,,,,,,,,,,,,,,,,,,,,,,,,,,,,,"Figure,landscape,print,water,Works-on-Paper",http://art-collections.museum.ucsb.edu/files/original/e956e62cf7f2f99a7add46844f94e480.jpg,"Physical Object","<strong>UCSB Alumni and Faculty</strong>",1,0
"<strong>MELLER</strong>, Peter","<em>Hercules Furens</em>","ca. 1970-80s","Meller, Peter","Incoming loan, courtesy John Moore",IL2014.001.024,,,,,,,,,,,,,,,,,,,,,,,,,,,,,,,,,,,,,,,,,,,,,"Figure,Ink,portrait,print,Seated,Works-on-Paper",http://art-collections.museum.ucsb.edu/files/original/5b534015457623db3992e1aaabb42759.jpg,"Physical Object","<strong>UCSB Alumni and Faculty</strong>",1,0
"<strong>MELLER</strong>, Peter","<em>Hercules Furens</em>","ca. 1970-80s","Meller, Peter","Incoming loan, courtesy John Moore",IL2014.001.025,,,,,,,,,,,,,,,,,,,,,,,,,,,,,,,,,,,,,,,,,,,,,"Figure,Ink,portrait,Seated,Works-on-Paper",http://art-collections.museum.ucsb.edu/files/original/ae959c03a9e31ac15910cdf3721d3012.jpg,"Physical Object","<strong>UCSB Alumni and Faculty</strong>",1,0
"<strong>MELLER</strong>, Peter","<em>Playwright with Cosmic Mask (Nero?)</em>","ca. 1970-80s","Meller, Peter","Incoming loan, courtesy John Moore",IL2014.001.032,,,,,,,,,,,,,,,,,,,,,,,,,,,,,,,,,,,,,,,,,,,,,"Figure,Mask,portrait,Seated,Works-on-Paper",http://art-collections.museum.ucsb.edu/files/original/8e5092020af0216a19a2d3e9696dd682.jpg,"Physical Object","<strong>UCSB Alumni and Faculty</strong>",1,0
"<strong>MELLER</strong>, Peter","<em>Nero with Cosmic Mask</em>","ca. 1970-80s","Meller, Peter","Incoming loan, courtesy John Moore",IL2014.001.033,,,,,,,,,,,,,,,,,,,,,,,,,,,,,,,,,,,,,,,,,,,,,"Figure,Mask,portrait,print,Seated,Works-on-Paper",http://art-collections.museum.ucsb.edu/files/original/d8c2f47166fc6ef69d80a90809a5407a.jpg,"Physical Object","<strong>UCSB Alumni and Faculty</strong>",1,0
"<strong>MELLER</strong>, Peter","<em>Risum Teneatis Amici?</em>","ca. 1970-80s","Meller, Peter","Gift of John Moore in memory of Peter and Judit Meller",2014.004.005,,,,,,,,,,,,,,,,,,,,,,,,,,,,,,,,,,,,,,,,,,,,,"Figure,Ink,portrait,print,Works-on-Paper",http://art-collections.museum.ucsb.edu/files/original/25d66e8a5dd2d6bc0cfc17eb72f75556.jpg,"Physical Object","<strong>UCSB Alumni and Faculty</strong>",1,0
"<strong>Artist unknown</strong>",<em>Figure</em>,n.d,"<strong>Artist unknown</strong>",,1973.209,,,,,,,,,,,,,,,,,,,,,,,,,,,,,,,,,,,,,,,,,,,,,"brass,Figurative,Figure,metal,Sculpture",http://art-collections.museum.ucsb.edu/files/original/d9bdc877ab25fb5c598b99ae2c5f6882.JPG,"Physical Object","<strong>Sculpture and Mixed Media</strong>",1,0
"<strong>WARSHAW</strong>, Howard",<em>Untitled</em>,"20th C.","<strong>WARSHAW</strong>, Howard","Gift of Professor Alfred Moir",1973.153,,,,,,,,,,,,,,,,,,,,,,,,,,,,,,,,,,,,,,,,,,,,,"etching,Figurative,Figure,portrait,Works-on-Paper",http://art-collections.museum.ucsb.edu/files/original/096805b6eebe179364619c9891059246.jpg,"Physical Object","<strong>UCSB Alumni and Faculty</strong>",1,0
<strong>African</strong>,"<em>African Wood Staff</em>",n.d.,<strong>African</strong>,"Gift of Mrs. William T. Campbell",1969.246,,,,,,,,,,,,,,,,,,,,,,,,,,,,,,,,,,,,,,,,,,,,,"Figure,Sculpture,staff,still life,Wood",http://art-collections.museum.ucsb.edu/files/original/7ff6ac4e1e9e7b538e9c3e543b2c9de3.jpg,"Physical Object","<strong>The Arts of Africa</strong>",1,0
"<strong>Asante, Ghana</strong>",<em>Goldweight</em>,"20th C.","<strong>Asante, Ghana</strong>","Gift of Mr. and Mrs. Herbert Cole",1973.69,,,,,,,,,,,,,,,,,,,,,,,,,,,,,,,,,,,,,,,,,,,,,"20th century,brass,Figurative,Figure,Sculpture",http://art-collections.museum.ucsb.edu/files/original/9150af16f6685eaf98cce7fb8ab1aa45.jpg,"Physical Object","<strong>The Arts of Africa</strong>",1,0
"<strong>Asante, Ghana</strong>",<em>Goldweight</em>,"20th C.","<strong>Asante, Ghana</strong>","Gift of Mr. and Mrs. Herbert Cole",1973.70,,,,,,,,,,,,,,,,,,,,,,,,,,,,,,,,,,,,,,,,,,,,,"20th century,brass,Figurative,Figure,Sculpture",http://art-collections.museum.ucsb.edu/files/original/e38bd1b2d1e5c7f7f2e78d37836dd019.jpg,"Physical Object","<strong>The Arts of Africa</strong>",1,0
"<strong>Asante, Ghana</strong>","<em>Figure: Akua'ba</em>","20th C.","<strong>Asante, Ghana</strong>","UCSB Art Affiliates Purchase Fund",1973.56,,,,,,,,,,,,,,,,,,,,,,,,,,,,,,,,,,,,,,,,,,,,,"20th century,Figurative,Figure,Sculpture,Wood",http://art-collections.museum.ucsb.edu/files/original/201c18bf7dc4d5e81c8560fdcf3dd067.jpg,"Physical Object","<strong>The Arts of Africa</strong>",1,0
"<strong>Asante, Ghana</strong>","<em>Standing Figure</em>","20th C.","<strong>Asante, Ghana</strong>","UCSB Art Affiliates Purchase Fund",1973.64,,,,,,,,,,,,,,,,,,,,,,,,,,,,,,,,,,,,,,,,,,,,,"Figurative,Figure,Sculpture,standing,Wood","http://art-collections.museum.ucsb.edu/files/original/aa72323267ca45d00ae7b02a47abf4b7.jpg,http://art-collections.museum.ucsb.edu/files/original/8abd0b2b378074a3ad1345bbee18cc57.jpg","Physical Object","<strong>The Arts of Africa</strong>",1,0
"<strong>b. Ghana, 20th Century</strong>","<em>Gold weight</em>","20th Century","<strong>b. Ghana</strong>","Gift of Mr. and Mrs. Herbert Cole",1973.71,,,,,,,,,,,,,,,,,,,,,,,,,,,,,,,,,,,,,,,,,,,,,"20th century,brass,Figurative,Figure,Sculpture","http://art-collections.museum.ucsb.edu/files/original/3f106dc1e88c1b88be6f8773ef604d1e.jpg,http://art-collections.museum.ucsb.edu/files/original/fb49e1dbe3e744cf93fa1c1782b38a24.jpg","Physical Object","<strong>The Arts of Africa</strong>",1,0
"<strong>Bamana peoples of Mali</strong>","<em>Boli Power figure for the Kono society</em>","20th C.","<strong>Bamana peoples of Mali</strong>","Gift of Dr. and Mrs. Aaron Nisenson",1985.64,,,,,,,,,,,,,,,,,,,,,,,,,,,,,,,,,,,,,,,,,,,,,"Figure,Sculpture,spiritual,still life,Wood","http://art-collections.museum.ucsb.edu/files/original/e0d5b84ab712c40dae23e807540d3298.jpg,http://art-collections.museum.ucsb.edu/files/original/e62bbd8ebe84d3cc0c7e62966ac58bb2.jpg,http://art-collections.museum.ucsb.edu/files/original/a7565126fc52d67cc2d64b347d0f53fa.jpg","Physical Object","<strong>The Arts of Africa</strong>",1,0
"<strong>Chokwe? Zaire</strong>","<em>Praying Figure</em>","ca. 20th C.","<strong>Chokwe? Zaire</strong>","Gift of Drs. William and Jane Bertrand",1991.110,,,,,,,,,,,,,,,,,,,,,,,,,,,,,,,,,,,,,,,,,,,,,"Figure,Praying,Religion,Sculpture,Wood",http://art-collections.museum.ucsb.edu/files/original/7de42cc054c8d68cf6dd3b4b6988b50d.jpg,"Physical Object","<strong>The Arts of Africa</strong>",1,0
<strong>Dogon</strong>,"<em>Votive Figure</em>","20th century",<strong>Dogon</strong>,"MUSEUM PURCHASE FUND",1997.60,,,,,,,,,,,,,,,,,,,,,,,,,,,,,,,,,,,,,,,,,,,,,"20th century,Figurative,Figure,Sculpture,Wood",http://art-collections.museum.ucsb.edu/files/original/b0f3b9bb4645101957a4a2b5f521f685.jpg,"Physical Object","<strong>The Arts of Africa</strong>",1,0
"<strong>Ewe, Ghana/Togo</strong>",<em>Figure</em>,"20th C.","<strong>Ewe, Ghana/Togo</strong>",,1973.82,,,,,,,,,,,,,,,,,,,,,,,,,,,,,,,,,,,,,,,,,,,,,"20th century,Figurative,Figure,Sculpture,Wood",http://art-collections.museum.ucsb.edu/files/original/bb3bef8b375830d5473f42287b88ea6d.jpg,"Physical Object","<strong>The Arts of Africa</strong>",1,0
"<strong>Olowe of Ise, Ikere village, Ekiti region, Nigeria</strong>","<em>Kneeling figure holding a bowl</em>","19-20th C.","<strong>Olowe of Ise, Ikere village, Ekiti region, Nigeria</strong>","Gift of Ceil and Michael Pulitzer",2011.007.013,,,,,,,,,,,,,,,,,,,,,,,,,,,,,,,,,,,,,,,,,,,,,"bowl,Female,Figurative,Figure,Sculpture,Wood","http://art-collections.museum.ucsb.edu/files/original/0f465e8dba6d3d56c4304e8e952562ff.jpg,http://art-collections.museum.ucsb.edu/files/original/8194583c9a5656c562f61b602bb3716b.jpg,http://art-collections.museum.ucsb.edu/files/original/db402a62b39ab3208448597d4ec27da1.jpg,http://art-collections.museum.ucsb.edu/files/original/9146451d4126d7a07d15541e7c9e0ec7.jpg","Physical Object","<strong>The Arts of Africa</strong>",1,0
"<strong>Yaka, Zaire, Africa</strong>","<em>Fetish or Power Figure</em>","20th C.","<strong>Yaka, Zaire, Africa</strong>","Gift of Mr. and Mrs. Herbert Cole through UCSB ART AFFILIATES",1973.83,,,,,,,,,,,,,,,,,,,,,,,,,,,,,,,,,,,,,,,,,,,,,"Fiber,Figurative,Figure,Sculpture,Wood","http://art-collections.museum.ucsb.edu/files/original/b48e0fb88a521e78e394340c6b8925d2.jpg,http://art-collections.museum.ucsb.edu/files/original/c7ac256900e18eea1557c40b38eafbd5.jpg,http://art-collections.museum.ucsb.edu/files/original/fdecd44c552ea893e760b22229726893.jpg,http://art-collections.museum.ucsb.edu/files/original/8e3cf93b26e8f8e7f4ba2060f23fdc6c.jpg","Physical Object","<strong>The Arts of Africa</strong>",1,0
"<strong>Yoruba, SW Nigeria</strong>","<em>Ibeji (Twin Figure)</em>",n.d.,"<strong>Yoruba, SW Nigeria</strong>","Gift of Professor Alfred Moir",1992.182,,,,,,,,,,,,,,,,,,,,,,,,,,,,,,,,,,,,,,,,,,,,,"Carved,Figurative,Figure,Sculpture,Wood","http://art-collections.museum.ucsb.edu/files/original/2055fe9c960a134ca80a9e772df34ecc.jpg,http://art-collections.museum.ucsb.edu/files/original/131dbd1ff27e0ec6ac0a3b0f337777df.jpg,http://art-collections.museum.ucsb.edu/files/original/77cc841029270cf9738ed61e7c875fdb.jpg,http://art-collections.museum.ucsb.edu/files/original/fbcfe6f16e7aa4385681214548c18ba8.jpg","Physical Object","<strong>The Arts of Africa</strong>",1,0
"<strong>Yoruba, W Nigeria</strong>","<em>Ibeji Figure</em>",n.d.,"<strong>Yoruba, W Nigeria</strong>","Gift of John and Andrea Rich",1986.428.2,,,,,,,,,,,,,,,,,,,,,,,,,,,,,,,,,,,,,,,,,,,,,"Beads,Figurative,Figure,Male,metal,Sculpture,shell,Wood","http://art-collections.museum.ucsb.edu/files/original/15c58a0d4b27718b6a434d01ce382447.jpg,http://art-collections.museum.ucsb.edu/files/original/35cd7c180cd208190667486232d956ad.jpg,http://art-collections.museum.ucsb.edu/files/original/85f3c44421491bc849048819459167b4.jpg","Physical Object","<strong>The Arts of Africa</strong>",1,0
"<strong>Yoruba, African</strong>","<em>Standing Figure of a Man</em>",n.d.,"<strong>Yoruba, African</strong>",,1973.119,,,,,,,,,,,,,,,,,,,,,,,,,,,,,,,,,,,,,,,,,,,,,"Figurative,Figure,man,Sculpture,standing,Wood","http://art-collections.museum.ucsb.edu/files/original/2a7612521b069ee3450deb13964db623.jpg,http://art-collections.museum.ucsb.edu/files/original/d2451c9b9c2aeefdd1d17975fc1a0455.jpg,http://art-collections.museum.ucsb.edu/files/original/0dfc596f400626a7d890a8d2dbd8601f.jpg,http://art-collections.museum.ucsb.edu/files/original/e0245b121097777db468bc8be01026dd.jpg","Physical Object","<strong>The Arts of Africa</strong>",1,0
"<strong>Yoruba, Nigeria</strong>","<em>Ibeji Figure</em>",n.d.,"<strong>Yoruba, Nigeria</strong>","Gift of John and Andrea Rich",1987.36.b,,,,,,,,,,,,,,,,,,,,,,,,,,,,,,,,,,,,,,,,,,,,,"Beads,Figurative,Figure,Sculpture,Wood","http://art-collections.museum.ucsb.edu/files/original/2772214de52e5a6bd5e19933a3df63e6.jpg,http://art-collections.museum.ucsb.edu/files/original/0aa76d499cf4ab1ec253ba676674ae57.jpg,http://art-collections.museum.ucsb.edu/files/original/c77c4c4851426687dda33c977ea71cba.jpg,http://art-collections.museum.ucsb.edu/files/original/5adf24ed8c2707521b1cab61de132567.jpg","Physical Object","<strong>The Arts of Africa</strong>",1,0
"<strong>Yoruba, Nigeria</strong>","<em>Ibeji Figure</em>",n.d.,"<strong>Yoruba, Nigeria</strong>","Gift of Mrs. Bernadette Miller",1981.77,,,,,,,,,,,,,,,,,,,,,,,,,,,,,,,,,,,,,,,,,,,,,"Figurative,Figure,Iron,Sculpture,Wood","http://art-collections.museum.ucsb.edu/files/original/d8ccfc0159e0cb8e2bf18a0fa0c89f94.jpg,http://art-collections.museum.ucsb.edu/files/original/6ed37bc183cc254712f3e6a7cb7cc535.jpg,http://art-collections.museum.ucsb.edu/files/original/2f142cf6175a5ab658826f87d2a78e8e.jpg,http://art-collections.museum.ucsb.edu/files/original/2c1451db02e8f7b6cd19d4e8b16397f1.jpg","Physical Object","<strong>The Arts of Africa</strong>",1,0
"<strong>Yoruba, Nigeria</strong>","<em>Ikenga Figure</em>",n.d.,"<strong>Yoruba, Nigeria</strong>","Gift of Mrs. Douglas Fraser",1987.72,,,,,,,,,,,,,,,,,,,,,,,,,,,,,,,,,,,,,,,,,,,,,"Carved,Face,Figurative,Figure,Sculpture,Wood","http://art-collections.museum.ucsb.edu/files/original/b875716ade45d789d1b6b4fee59ccb90.jpg,http://art-collections.museum.ucsb.edu/files/original/dea3e37ebed10d25859743dee3e6c873.jpg","Physical Object","<strong>The Arts of Africa</strong>",1,0
"<strong>Yoruba, Nigeria</strong>","<em>""Bell"" Ogboni</em>",n.d.,"<strong>Yoruba, Nigeria</strong>","Gift of Mrs. Douglas Fraser",1987.76,,,,,,,,,,,,,,,,,,,,,,,,,,,,,,,,,,,,,,,,,,,,,"bell,brass,Figurative,Figure,Headdress,Sculpture,Seated",http://art-collections.museum.ucsb.edu/files/original/603879f5d40d73570ee785e97a93d144.jpg,"Physical Object","<strong>The Arts of Africa</strong>",1,0
"<strong>Zuko of Birifor Tcha, No. Ghana, Africa</strong>",<em>Figure</em>,"20th C. (1972)","<strong>Zuko of Birifor Tcha, No. Ghana, Africa</strong>",,1973.84,,,,,,,,,,,,,,,,,,,,,,,,,,,,,,,,,,,,,,,,,,,,,"20th century,Figurative,Figure,Sculpture,Wood",http://art-collections.museum.ucsb.edu/files/original/4535a3441368085875221b32bcb69c97.jpg,"Physical Object","<strong>The Arts of Africa</strong>",1,0
"<strong>Artist unknown, Indian</strong>","<em>Bowl</em>, n.d.",n.d.,"<strong>Artist unknown, Indian</strong>",,1968.91,,,,,,,,,,,,,,,,,,,,,,,,,,,,,,,,,,,,,,,,,,,,,"bowl,Bronze,Figure,India,man,Sculpture,still life",http://art-collections.museum.ucsb.edu/files/original/2a4b762d5bc74d308a0b56fbc65aa290.jpg,"Physical Object","<strong>The Arts of Asia</strong>",1,0
"<strong>YANOBE</strong>, Kenji","<em>Lunatic Park with Action figure, Badge and Atom Car</em>, ca. 1998","ca. 1998","<strong>YANOBE</strong>, Kenji","Gift of the Artist",2000.54.a-c,,,,,,,,,,,,,,,,,,,,,,,,,,,,,,,,,,,,,,,,,,,,,"action figure,boy,car,Figure,Japan,plastic,Sculpture,still life,Yellow",http://art-collections.museum.ucsb.edu/files/original/3fe99e2fcd5f706e19c3c040b5e8b69d.jpg,"Physical Object","<strong>The Arts of Asia</strong>",1,0
"<strong>NAVA</strong>, John","<em>LC 2 (Rachel)</em>",2016,"<strong>NAVA</strong>, John","Gift of the Nava Family Trust",2020.002.002,,,,,,,,,,,,,,,,,,,,,,,,,,,,,,,,,,,,,,,,,,,,,"black chair,Figure,nude,oil,Painting,portrait,woman",http://art-collections.museum.ucsb.edu/files/original/cbdb82a7ab3fb475ea121eedcb36fdb0.jpg,"Physical Object",<strong>Paintings</strong>,1,0
"<strong>Nigeria, Benin Kigndom</strong>","<em>Oba spiritual figure</em>",n.d.,"<strong>Nigeria, Benin Kigndom</strong>","Gift of Dr. Fima and Jere Lifshitz",2020.003.055,,,,,,,,,,,,,,,,,,,,,,,,,,,,,,,,,,,,,,,,,,,,,"brass,Figurative,Figure,Sculpture,spiritual","http://art-collections.museum.ucsb.edu/files/original/1f2faa88847bbc1ef6c3a3c9b9bf460c.jpg,http://art-collections.museum.ucsb.edu/files/original/4a1daa2a9739a05cff3682681a61eb31.JPG,http://art-collections.museum.ucsb.edu/files/original/97dd4634d0e65d81886e9067be423c5c.JPG","Physical Object","<strong>The Arts of Africa</strong>",1,0
