﻿"Dublin Core:Title","Dublin Core:Description","Dublin Core:Date","Dublin Core:Creator","Dublin Core:Source","Dublin Core:Identifier","Dublin Core:Contributor","Dublin Core:Rights","Dublin Core:Relation","Dublin Core:Format","Dublin Core:Language","Dublin Core:Type","Dublin Core:Coverage","Dublin Core:Subject","Dublin Core:Publisher","Item Type Metadata:Birth Date","Item Type Metadata:Birthplace","Item Type Metadata:Event Type","Item Type Metadata:Participants","Item Type Metadata:URL","Item Type Metadata:Death Date","Item Type Metadata:Occupation","Item Type Metadata:Biographical Text","Item Type Metadata:Bibliography","Item Type Metadata:File name","Item Type Metadata:Time Summary","Item Type Metadata:Interviewer","Item Type Metadata:Interviewee","Item Type Metadata:Location","Item Type Metadata:Transcription","Item Type Metadata:Local URL","Item Type Metadata:Original Format","Item Type Metadata:Physical Dimensions","Item Type Metadata:Duration","Item Type Metadata:Compression","Item Type Metadata:Producer","Item Type Metadata:Director","Item Type Metadata:Bit Rate/Frequency","Item Type Metadata:Text","Item Type Metadata:Email Body","Item Type Metadata:Subject Line","Item Type Metadata:From","Item Type Metadata:To","Item Type Metadata:CC","Item Type Metadata:BCC","Item Type Metadata:Number of Attachments","Item Type Metadata:Standards","Item Type Metadata:Objectives","Item Type Metadata:Materials","Item Type Metadata:Tags",tags,file,itemType,collection,public,featured
"<strong>KURODA</strong>, Aki","<em>L-Art Vivant Trois Figures</em>, 1984",1984,"<strong>KURODA</strong>, Aki","Gift of Sharon and Terry Bridges",2011.005.014,,,,,,,,,,,,,,,,,,,,,,,,,,,,,,,,,,,,,,,,,,,,,"abstract,Japan,Lithograph,shapes,Works-on-Paper",http://art-collections.museum.ucsb.edu/files/original/eadb15904c8d64d123dc70c49e666c8f.jpg,"Physical Object","<strong>The Arts of Asia</strong>",1,0
"<strong>Artist unknown, Japanese</strong>","<em>Vue Interieure D'un Theatre a Jedo </em>",n.d.,"<strong>Artist unknown, Japanese</strong>",n.d.,1971.106,,,,,,,,,,,,,,,,,,,,,,,,,,,,,,,,,,,,,,,,,,,,,"Japan,Lithograph,portrait,theatre,Works-on-Paper",http://art-collections.museum.ucsb.edu/files/original/8f3f954ad716dfad2b8ecc334fb26fa2.jpg,"Physical Object","<strong>The Arts of Asia</strong>",1,0
"<strong>REALIER-DUMAS</strong> Maurice","<em>Societe Internationale</em>","20th C.","<strong>REALIER-DUMAS</strong> Maurice","University of California, Santa Barbara, Gift of Miss Margaret Mallory through UCSB Art Affiliates",1970.90,,,,,,,,,,,,,,,,,,,,,,,,,,,,,,,,,,,,,,,,,,,,,"Figurative,Lithograph,Purple Dress,Societe Internationale,woman,Works-on-Paper",http://art-collections.museum.ucsb.edu/files/original/2ee0955858c7d38a0f54f2e005bd6777.jpg,"Physical Object","<strong>The Margaret Mallory Bequest</strong>",1,0
"<strong>MERIDA</strong>, Carlos",<em>Untitled</em>,"20th C.","<strong>MERIDA</strong>, Carlos",,1973.52,,,,,,,,,,,,,,,,,,,,,,,,,,,,,,,,,,,,,,,,,,,,,"abstract,Figurative,Lithograph,Mexican,print,Works-on-Paper",http://art-collections.museum.ucsb.edu/files/original/8ee5b867f2f847f60b971d34406d5289.jpg,"Physical Object","<strong>The Arts of Latin America</strong>",1,0
"<strong>MERIDA</strong>, Carlos",Untitled,1934,"<strong>MERIDA</strong>, Carlos",,1973.51,,,,,,,,,,,,,,,,,,,,,,,,,,,,,,,,,,,,,,,,,,,,,"abstract,Figurative,Lithograph,Mexican,print,Works-on-Paper",http://art-collections.museum.ucsb.edu/files/original/853bdc88a1fce79772cb1813087337b6.jpg,"Physical Object","<strong>The Arts of Latin America</strong>",1,0
"<strong>MERIDA</strong>, Carlos",<em>Untitled</em>,1934,"<strong>MERIDA</strong>, Carlos",,1973.5,,,,,,,,,,,,,,,,,,,,,,,,,,,,,,,,,,,,,,,,,,,,,"abstract,Lithograph,Mexican,print,Works-on-Paper",http://art-collections.museum.ucsb.edu/files/original/01a2688f7f809d3a820c021556eab899.jpg,"Physical Object","<strong>The Arts of Latin America</strong>",1,0
"<strong>MERIDA</strong>, Carlos",<em>Untitled</em>,1934,"<strong>MERIDA</strong>, Carlos",,1973.49,,,,,,,,,,,,,,,,,,,,,,,,,,,,,,,,,,,,,,,,,,,,,"abstract,Lithograph,Mexican,print,Works-on-Paper",http://art-collections.museum.ucsb.edu/files/original/4999ccce9e5de090a9719b37ed38e1d4.jpg,"Physical Object","<strong>The Arts of Latin America</strong>",1,0
"<strong>HAMMOND</strong>, Jane","<em>Spells and Incantations</em>",2007,"<strong>HAMMOND</strong>, JANE","Gift of Kevin and Lotte Roache",2014.025.001,,,,,,,,,,,,,,,,,,,,,,,,,,,,,,,,,,,,,,,,,,,,,"egypt,Egyptian,gold,gold leaf,hieroglyphs,Lithograph,Mixed Media,Sculpture,silkscreen",http://art-collections.museum.ucsb.edu/files/original/24c802281bb6acd0f30e69dfa3a4926b.jpg,"Physical Object","<strong>Sculpture and Mixed Media</strong>",1,0
"<strong>Faulwell</strong>, Asad",<em>Djamila</em>,"2017- 2018","<strong>Faulwell</strong>, Asad","Museum purchase",2018.012.001,,,,,,,,,,,,,,,,,,,,,,,,,,,,,,,,,,,,,,,,,,,,,"21st century,collage,Female,floral,gold,Lithograph,portrait,works on paper",http://art-collections.museum.ucsb.edu/files/original/68e175b68bad63b0c37226240941f116.jpg,"Physical Object","<strong>Sculpture and Mixed Media</strong>",1,0
"<strong>TAMAYO</strong>, Rufino",<em>Head</em>,1975,"Tamayo, Rufino, 1899 - 1992, Mexican","Gift of Don Trevey to the Ken Trevey Collection of American Realist Prints",1995.57,,,,,,,,,,,,,,,,,,,,,,,,,,,,,,,,,,,,,,,,,,,,,"abstract,Figurative,head,Lithograph,Mexican,portrait,Works-on-Paper",http://art-collections.museum.ucsb.edu/files/original/863278557ea4c0b576a111df6ccacbcd.jpg,"Physical Object","<strong>The Arts of Latin America</strong>",1,0
"<strong>DOSAMENTES</strong>, Francisco","<em>Women of Oaxaca</em>",1946,"Dosamentes, Francisco, Mexican, 1911 -",,1975.89,,,,,,,,,,,,,,,,,,,,,,,,,,,,,,,,,,,,,,,,,,,,,"Lithograph,Mexican,Oaxaca,portrait,print,women,Works-on-Paper",http://art-collections.museum.ucsb.edu/files/original/3ff73a12ad162193c79cdf1cb71d7787.jpg,"Physical Object","<strong>The Arts of Latin America</strong>",1,0
"<strong>MERIDA</strong>, Carlos",<em>Untitled</em>,"20th. C.","Merida, Carlos, Mexican, 1891 -",,1973.52,,,,,,,,,,,,,,,,,,,,,,,,,,,,,,,,,,,,,,,,,,,,,"abstract,Figurative,Lithograph,Mexican,print,Works-on-Paper",http://art-collections.museum.ucsb.edu/files/original/1d114497eab9c475506c1cf2f79905df.jpg,"Physical Object","<strong>The Arts of Latin America</strong>",1,0
"<strong>MERIDA</strong>, Carlos",<em>Untitled</em>,1934,"Merida, Carlos, Mexican, 1891 -",,1973.51,,,,,,,,,,,,,,,,,,,,,,,,,,,,,,,,,,,,,,,,,,,,,"abstract,Figurative,Lithograph,Mexican,print,Works-on-Paper",http://art-collections.museum.ucsb.edu/files/original/5914cd8266c56b42da3bf644a758711f.jpg,"Physical Object","<strong>The Arts of Latin America</strong>",1,0
"<strong>MERIDA</strong>, Carlos",<em>Untitled</em>,1934,"Merida, Carlos, Mexican, 1891 -",,1973.50,,,,,,,,,,,,,,,,,,,,,,,,,,,,,,,,,,,,,,,,,,,,,"abstract,Lithograph,Mexican,print,Works-on-Paper",http://art-collections.museum.ucsb.edu/files/original/3b26bca878bf8668a0deb519de7a2f5e.jpg,"Physical Object","<strong>The Arts of Latin America</strong>",1,0
"<strong>MERIDA</strong>, Carlos",<em>Untitled</em>,1934,"Merida, Carlos, Mexican, 1891 -",,1973.49,,,,,,,,,,,,,,,,,,,,,,,,,,,,,,,,,,,,,,,,,,,,,"abstract,Lithograph,Mexican,print,Works-on-Paper",http://art-collections.museum.ucsb.edu/files/original/7d2d8a4f4cb213d3d7d2b2062f3d0f4b.jpg,"Physical Object","<strong>The Arts of Latin America</strong>",1,0
"<strong>HOCKNEY</strong>, David","<em>Pool I-F</em>",n.d.,"Hockney, David","Gift of Miss Margaret Mallory through UCSB Art Affiliates",1983.12,,,,,,,,,,,,,,,,,,,,,,,,,,,,,,,,,,,,,,,,,,,,,"Blue,Diving-Board,landscape,Lithograph,Pool,Works-on-Paper",http://art-collections.museum.ucsb.edu/files/original/310f23cb1f5257fc434ee61a546a2e9b.jpg,"Physical Object","<strong>The Margaret Mallory Bequest</strong>",1,0
"<strong>BEGGERSTAFF BROS.</strong>","<em>Harper's Magazine</em>","19th c.","Beggerstaff Bros.","University of California, Santa Barbara, Gift of Miss Margaret Mallory through UCSB Art Affiliates",1970.93,,,,,,,,,,,,,,,,,,,,,,,,,,,,,,,,,,,,,,,,,,,,,"Harper's,Lithograph,magazine,red,still life,Works-on-Paper",http://art-collections.museum.ucsb.edu/files/original/c5395ebb074c3f8cf4c6040fc14c4af0.jpg,"Physical Object","<strong>The Margaret Mallory Bequest</strong>",1,0
"<strong>REALIER-DUMAS,</strong> Maurice","<em>Societe Internationale</em>","20th c.","Realier-Dumas, Maurice","University of California, Santa Barbara, Gift of Miss Margaret Mallory through UCSB Art Affiliates",1970.90,,,,,,,,,,,,,,,,,,,,,,,,,,,,,,,,,,,,,,,,,,,,,"French,green bench,Lithograph,Purple Dress,still life,woman,Works-on-Paper",http://art-collections.museum.ucsb.edu/files/original/ceefdeec3fbf1b0addf409d2d37101d0.jpg,"Physical Object","<strong>The Margaret Mallory Bequest</strong>",1,0
Untitled,"<em>Cigaretten Laferme Dresden</em>",1897,,"University of California, Santa Barbara, Gift of Miss Margaret Mallory through the Art Affilites",1970.89,,,,,,,,,,,,,,,,,,,,,,,,,,,,,,,,,,,,,,,,,,,,,"cigarette,Lithograph,man,monocle,still life,suit,Works-on-Paper",http://art-collections.museum.ucsb.edu/files/original/ad332294b14b87d0f14402ee1b63f1c9.jpg,"Physical Object","<strong>The Margaret Mallory Bequest</strong>",1,0
"<strong>DENIS,</strong> Maurice","<em>La Depeche Grand Format</em>","20th c.","Denis, Maurice","University of California, Santa Barbara, Gift of Miss Margaret Mallory through UCSB Art Affiliates",1970.88,,,,,,,,,,,,,,,,,,,,,,,,,,,,,,,,,,,,,,,,,,,,,"French,Lithograph,newspaper,Red-Dress,still life,woman,Works-on-Paper",http://art-collections.museum.ucsb.edu/files/original/ca12922ac344cef0dd0de8fff449f1a7.jpg,"Physical Object","<strong>The Margaret Mallory Bequest</strong>",1,0
"<strong>CHERET</strong>, Jules","<em>Theatre de l'Opera</em>",1896,"Cheret, Jules","University of California, Santa Barbara, Gift of Miss Margaret Mallory through UCSB Art Affiliates",1970.87,,,,,,,,,,,,,,,,,,,,,,,,,,,,,,,,,,,,,,,,,,,,,"Gala,Green-Dress,Lithograph,Masks,Masquerade,still life,Works-on-Paper",http://art-collections.museum.ucsb.edu/files/original/f952bf94d283fd13bbd0d5b8dc0a495a.jpg,"Physical Object","<strong>The Margaret Mallory Bequest</strong>",1,0
"<strong>O'HARA</strong>, James Frederick","<em>The Hunt</em>","20th c.","O'hara, James Frederick","Gift of Miss Margaret Mallory",1961.8,,,,,,,,,,,,,,,,,,,,,,,,,,,,,,,,,,,,,,,,,,,,,"animal,Bison,Hunting,Lithograph,still life,Works-on-Paper",http://art-collections.museum.ucsb.edu/files/original/0872aaf1fc12165ccca6b30620c3205c.jpg,"Physical Object","<strong>The Margaret Mallory Bequest</strong>",1,0
"<strong>WARSHAW</strong>, Howard","<em>Four figures and head</em>",1950,"<strong>WARSHAW</strong>, Howard","Morse Bequest",1993.54,,,,,,,,,,,,,,,,,,,,,,,,,,,,,,,,,,,,,,,,,,,,,"figures,head,Lithograph,portrait,Works-on-Paper",http://art-collections.museum.ucsb.edu/files/original/faae622adb4392d77ae3fab3899e5a32.jpg,"Physical Object","<strong>UCSB Alumni and Faculty</strong>",1,0
"<strong>WARSHAW</strong>, Howard","<em>Hands and Globe</em>",1969,"<strong>WARSHAW</strong>, Howard",,1993.13.3,,,,,,,,,,,,,,,,,,,,,,,,,,,,,,,,,,,,,,,,,,,,,"abstract,Circle,Globe,hands,Lithograph,Works-on-Paper",http://art-collections.museum.ucsb.edu/files/original/99555b47888bbd0326017438a1f5a0df.jpg,"Physical Object","<strong>UCSB Alumni and Faculty</strong>",1,0
"<strong>WARSHAW</strong>, Howard","<em>Hands and Globe: Partial Image</em>",1969,"<strong>WARSHAW</strong>, Howard","Morse Bequest",1993.13.2,,,,,,,,,,,,,,,,,,,,,,,,,,,,,,,,,,,,,,,,,,,,,"abstract,Circle,Globe,hands,Lithograph,Works-on-Paper",http://art-collections.museum.ucsb.edu/files/original/178df60c482fb6a1dbc6f491f344e5c1.jpg,"Physical Object","<strong>UCSB Alumni and Faculty</strong>",1,0
"<strong>WARSHAW</strong>, Howard","<em>Hands and Globe</em>",1969,"WARSHAW, Howard","Morse Bequest",1993.13.1,,,,,,,,,,,,,,,,,,,,,,,,,,,,,,,,,,,,,,,,,,,,,"abstract,Globe,hands,Lithograph,Works-on-Paper",http://art-collections.museum.ucsb.edu/files/original/026f41291d540924cb64b48c5c774f51.jpg,"Physical Object","<strong>UCSB Alumni and Faculty</strong>",1,0
"<strong>DOLE</strong>, William","<em>Small Mnemonic Devices</em>",1971,"<strong>DOLE</strong>, William","Found in Collection",2012.007.009,,,,,,,,,,,,,,,,,,,,,,,,,,,,,,,,,,,,,,,,,,,,,"abstract,black and white,line,Lithograph,Works-on-Paper",http://art-collections.museum.ucsb.edu/files/original/34c212b047434eac16e232bf2140127d.jpg,"Physical Object","<strong>UCSB Alumni and Faculty</strong>",1,0
"<strong>DOLE</strong>, William","<em>Small Mnemonic Devices</em>",1971,"<strong>DOLE</strong>, William","Found in Collection",2012.007.008,,,,,,,,,,,,,,,,,,,,,,,,,,,,,,,,,,,,,,,,,,,,,"abstract,black and white,Lithograph,shapes,Works-on-Paper",http://art-collections.museum.ucsb.edu/files/original/d22e980bf097b84767210bf9c15c2b6d.jpg,"Physical Object","<strong>UCSB Alumni and Faculty</strong>",1,0
"<strong>DOLE</strong>, William","<em>Small Mnemonic Devices</em>",1971,"<strong>DOLE</strong>, William","Found in Collection",2012.007.007,,,,,,,,,,,,,,,,,,,,,,,,,,,,,,,,,,,,,,,,,,,,,"abstract,Lithograph,red,squares,Works-on-Paper",http://art-collections.museum.ucsb.edu/files/original/0725a7826344c55029bfc79393ae3ed8.jpg,"Physical Object","<strong>UCSB Alumni and Faculty</strong>",1,0
"<strong>DOLE</strong>, William","<em>Small Mnemonic Devices</em>",1971,"<strong>DOLE</strong>, William","Found in Collection",2012.007.006,,,,,,,,,,,,,,,,,,,,,,,,,,,,,,,,,,,,,,,,,,,,,"abstract,Lithograph,numbers,sheet,Works-on-Paper",http://art-collections.museum.ucsb.edu/files/original/b018ca39e950cfd5ac232470755644c4.jpg,"Physical Object","<strong>UCSB Alumni and Faculty</strong>",1,0
"<strong>DOLE</strong>, William","<em>Small Mnemonic Devices</em>",1971,"<strong>DOLE</strong>, William","Found in Collection",2012.007.005,,,,,,,,,,,,,,,,,,,,,,,,,,,,,,,,,,,,,,,,,,,,,"abstract,black and white,Lithograph,words,Works-on-Paper",http://art-collections.museum.ucsb.edu/files/original/99122e6837712a0fb5008fa0f7b66103.jpg,"Physical Object","<strong>UCSB Alumni and Faculty</strong>",1,0
"<strong>DOLE</strong>, William","<em>Small Mnemonic Devices - introduction</em>",1971,"<strong>DOLE</strong>, William","Found in Collection",2012.007.002,,,,,,,,,,,,,,,,,,,,,,,,,,,,,,,,,,,,,,,,,,,,,"abstract,black and white,Lithograph,words,Works-on-Paper",http://art-collections.museum.ucsb.edu/files/original/0a9987bed6a126df9307d7903df7e6b4.jpg,"Physical Object","<strong>UCSB Alumni and Faculty</strong>",1,0
"<strong>DOLE</strong>, William","<em>Small Mnemonic Devices</em>",1971,"<strong>DOLE</strong>, William",,1973.8,,,,,,,,,,,,,,,,,,,,,,,,,,,,,,,,,,,,,,,,,,,,,"abstract,Lithograph,shapes,Works-on-Paper",http://art-collections.museum.ucsb.edu/files/original/85f39e69fa4491d0a4de39f88e2dd385.jpg,"Physical Object","<strong>UCSB Alumni and Faculty</strong>",1,0
"<strong>DOLE</strong>, William","<em>Small Mnemonic Devices</em>",1971,"<strong>DOLE</strong>, William",,1973.7,,,,,,,,,,,,,,,,,,,,,,,,,,,,,,,,,,,,,,,,,,,,,"abstract,Lithograph,shapes,Works-on-Paper",http://art-collections.museum.ucsb.edu/files/original/0276b3f6d3ac891ff6df44e2843c568d.jpg,"Physical Object","<strong>UCSB Alumni and Faculty</strong>",1,0
"<strong>DOLE</strong>, William","<em>Small Mnemonic Devices</em>",1971,"<strong>DOLE</strong>, William",,1973.6,,,,,,,,,,,,,,,,,,,,,,,,,,,,,,,,,,,,,,,,,,,,,"abstract,Lithograph,shapes,Works-on-Paper",http://art-collections.museum.ucsb.edu/files/original/8d0b25a73b9bcff13658ae3d8aab75a3.jpg,"Physical Object","<strong>UCSB Alumni and Faculty</strong>",1,0
"<strong>DOLE</strong>, William","<em>Small Mnemonic Devices</em>",1971,"<strong>DOLE</strong>, William",,1973.4,,,,,,,,,,,,,,,,,,,,,,,,,,,,,,,,,,,,,,,,,,,,,"abstract,Lithograph,numbers,shapes,Works-on-Paper",http://art-collections.museum.ucsb.edu/files/original/d23bead62dde464c88af6d34ae7a7f07.jpg,"Physical Object","<strong>UCSB Alumni and Faculty</strong>",1,0
"DOLE, William","Small Mnemonic Devices",1971,"DOLE, William",,1973.3,,,,,,,,,,,,,,,,,,,,,,,,,,,,,,,,,,,,,,,,,,,,,"Lithograph,paper,shapes,still life,words,Works-on-Paper",http://art-collections.museum.ucsb.edu/files/original/1321279cb061dbca10486c9200dd8949.jpg,"Physical Object","<strong>UCSB Alumni and Faculty</strong>",1,0
"<strong>DOLE</strong>, William","<em>Small Mnemonic Devices</em>",1971,"<strong>DOLE</strong>, William",,1973.2,,,,,,,,,,,,,,,,,,,,,,,,,,,,,,,,,,,,,,,,,,,,,"Lithograph,shapes,still life,words,Works-on-Paper",http://art-collections.museum.ucsb.edu/files/original/25cfe15d8f4b3ad04a11b7375112b724.jpg,"Physical Object","<strong>UCSB Alumni and Faculty</strong>",1,0
"<strong>DOLE</strong>, William","<em>Small Mnemonic Devices</em>",1971,"<strong>DOLE</strong>, William","Gift of the artist",1973.1C,,,,,,,,,,,,,,,,,,,,,,,,,,,,,,,,,,,,,,,,,,,,,"abstract,Letters,Lithograph,shapes,Works-on-Paper",http://art-collections.museum.ucsb.edu/files/original/a2b89a5b6137391640929c751ef656d0.jpg,"Physical Object","<strong>UCSB Alumni and Faculty</strong>",1,0
"<strong>DOLE</strong>, William","<em>Small Mnemonic Devices</em>","20th c.","<strong>DOLE</strong>, William",,1973.1A,,,,,,,,,,,,,,,,,,,,,,,,,,,,,,,,,,,,,,,,,,,,,"Lithograph,shapes,sheet,still life,words,Works-on-Paper",http://art-collections.museum.ucsb.edu/files/original/7a564aa415bf436265853e9863a92dc3.jpg,"Physical Object","<strong>UCSB Alumni and Faculty</strong>",1,0
"<strong>BECHTOLD</strong>, Erwin",<em>Untitled</em>,1972,"Bechtold, Erwin","Ruth S. Schaffner Collection",1987.10,,,,,,,,,,,,,,,,,,,,,,,,,,,,,,,,,,,,,,,,,,,,,"Figurative,grey,Lithograph,red,White,works on paper",http://art-collections.museum.ucsb.edu/files/original/58cc6d959573c30e1448da9df76f38eb.jpg,"Physical Object","<strong>The Ruth S. Schaffner Collection</strong>",1,0
"<strong>BEUYS</strong>, Joseph","<em>We Can't Do It Without Roses</em>",1972,"Beuys, Joseph","Ruth S. Schaffner Collection",1987.6,,,,,,,,,,,,,,,,,,,,,,,,,,,,,,,,,,,,,,,,,,,,,"20th century,black and white,Lithograph,man,photograph,portrait,roses",http://art-collections.museum.ucsb.edu/files/original/2699df1c67d0635712dc64530904e8cc.jpg,"Physical Object","<strong>The Ruth S. Schaffner Collection</strong>",1,0
"<strong>RIVERS</strong>, Larry","<em>Portrait of Ed Gordon</em>",1969,"Rivers, Larry","Ruth S. Schaffner Collection",1986.59,,,,,,,,,,,,,,,,,,,,,,,,,,,,,,,,,,,,,,,,,,,,,"color,Lithograph,man,photograph,portrait,sepia",http://art-collections.museum.ucsb.edu/files/original/8d5d067c9c5c2942c92772ac1a288cea.jpg,"Physical Object","<strong>The Ruth S. Schaffner Collection</strong>",1,0
"<b>KRIFKA</b>, Laura","<em>Arrowhead in Red</em>",2016,"<strong>KRIFKA</strong>, Laura","Museum purchase",2017.001.001,,,,,,,,,,,,,,,,,,,,,,,,,,,,,,,,,,,,,,,,,,,,,"arrow,Lithograph,portrait,Screenprint,woman,Works-on-Paper",http://art-collections.museum.ucsb.edu/files/original/7e01931ff73c8c0e53e13dac88bd3368.jpg,"Physical Object","<strong>UCSB Alumni and Faculty</strong>",1,0
"<strong>DI SUVERO</strong>, Mark","<em>Future Shadow B</em>",2001,"<strong>DI SUVERO</strong>, Mark","Gift of the artist in memory of Henrietta di Suvero",2014.024.001,,,,,,,,,,,,,,,,,,,,,,,,,,,,,,,,,,,,,,,,,,,,,"abstract,Cross,Lithograph,red,Works-on-Paper",http://art-collections.museum.ucsb.edu/files/original/5e75917a75b5dd9d2aac97ebab554169.jpg,"Physical Object","<strong>UCSB Alumni and Faculty</strong>",1,0
"<strong>BROWN</strong>, Gary H.","<em>Mayan Journey of G. B.</em>",n.d.,"<strong>BROWN</strong>, Gary H.","Gift of Charles Craig, Jr.",1986.462,,,,,,,,,,,,,,,,,,,,,,,,,,,,,,,,,,,,,,,,,,,,,"Girl,indigenous,Lithograph,portrait,poster,Works-on-Paper",http://art-collections.museum.ucsb.edu/files/original/4a7d82e511d01f86f5628820b8b16073.jpg,"Physical Object","<strong>UCSB Alumni and Faculty</strong>",1,0
"<strong>Artist unknown</strong>","<em>Souvenir Book of Geneva</em>",n.d.,"<strong>Artist unknown</strong>","Gift of Mr. Keith Gledhill",1986.292,,,,,,,,,,,,,,,,,,,,,,,,,,,,,,,,,,,,,,,,,,,,,"Border Details,Lithograph,photograph,purple,Souvenir Book of Geneva,still life",http://art-collections.museum.ucsb.edu/files/original/1aa5458703d1b5a48871d35918e7c747.jpg,"Physical Object","<strong>The Carolyn and Edwin Gledhill Photography Collection</strong>",1,0
"<strong>Artist unknown</strong>","<em>Fold out: L'Universite</em>",n.d.,"<strong>Artist unknown</strong>","Gift of Mr. Keith Gledhill",1986.262,,,,,,,,,,,,,,,,,,,,,,,,,,,,,,,,,,,,,,,,,,,,,"architecture,L' Universite,Lithograph,monument,National,Post card,statue,Works-on-Paper","http://art-collections.museum.ucsb.edu/files/original/3f0616fb7cbcd8f244257fc75f932858.jpg,http://art-collections.museum.ucsb.edu/files/original/4fbb34db3d015d54e0f9b2b08d9cb3aa.jpg","Physical Object","<strong>The Carolyn and Edwin Gledhill Photography Collection</strong>",1,0
"<strong>Artist unknown</strong>","<em>Geneva picture book: Le Theatre</em>",n.d.,"<strong>Artist unknown</strong>","Gift of Mr. Keith Gledhill",1986.257.2,,,,,,,,,,,,,,,,,,,,,,,,,,,,,,,,,,,,,,,,,,,,,"architecture,French,Gargoyle,Geneva Picture Book,Lithograph,Theater,Works-on-Paper",http://art-collections.museum.ucsb.edu/files/original/ff5a3d83a1be929312b3e7e6c2379e87.jpg,"Physical Object","<strong>The Carolyn and Edwin Gledhill Photography Collection</strong>",1,0
"<strong>Artist unknown</strong>","<em>Geneva picture book: Musee Rath</em>",n.d.,"<strong>Artist unknown</strong>","Gift of Mr. Keith Gledhill",1986.257.1,,,,,,,,,,,,,,,,,,,,,,,,,,,,,,,,,,,,,,,,,,,,,"architecture,black and white,French,Geneva Picture Book,Lithograph,Musee Rath,Works-on-Paper",http://art-collections.museum.ucsb.edu/files/original/ec9f5fe43a8910120126b03633e680ae.jpg,"Physical Object","<strong>The Carolyn and Edwin Gledhill Photography Collection</strong>",1,0
"<strong>Artist unknown</strong>","<em>Directions for Cleaning Marble Statuary (Business Card)</em>",n.d.,"<strong>Artist unknown</strong>","Gift of Mr. Keith Gledhill",1986.247,,,,,,,,,,,,,,,,,,,,,,,,,,,,,,,,,,,,,,,,,,,,,"Business Card,Directions for Cleaning Marble Statuary,Florence,Italian Marble,Italy,Lithograph,Poggioni,portrait,Spinelli,Works-on-Paper",http://art-collections.museum.ucsb.edu/files/original/87b90644d1511a5bbb62e5929c51cb6e.jpg,"Physical Object","<strong>The Carolyn and Edwin Gledhill Photography Collection</strong>",1,0
"<strong>Artist unknown</strong>","<em>Original race of Philipino Maccabebe Tribe</em>",n.d.,"<strong>Artist unknown</strong>","Gift of Mr. Keith Gledhill",1986.224,,,,,,,,,,,,,,,,,,,,,,,,,,,,,,,,,,,,,,,,,,,,,"Arrows,Bows,Jungle,Lithograph,Philipino Maccabebe Tribe,photograph,portrait",http://art-collections.museum.ucsb.edu/files/original/16692d051731f4af84952cd646be0866.jpg,"Physical Object","<strong>The Carolyn and Edwin Gledhill Photography Collection</strong>",1,0
"<strong>Artist unknown</strong>","<em>Scene on Laguna de Bay</em>",n.d.,"<strong>Artist unknown</strong>","Gift of Mr. Keith Gledhill",1986.223,,,,,,,,,,,,,,,,,,,,,,,,,,,,,,,,,,,,,,,,,,,,,"Boat,Bows,Canoe,fishing,Laguna de Bay,landscape,Lithograph,photograph",http://art-collections.museum.ucsb.edu/files/original/144268a6b4c948793673a486b8f92c04.jpg,"Physical Object","<strong>The Carolyn and Edwin Gledhill Photography Collection</strong>",1,0
"<strong>Artist unknown</strong>","<em>Two Men with Oxen In Field</em>",n.d.,"<strong>Artist unknown</strong>","Gift of Mr. Keith Gledhill",1986.221,,,,,,,,,,,,,,,,,,,,,,,,,,,,,,,,,,,,,,,,,,,,,"Farmer,field,hat,landscape,Lithograph,men,oxen,photograph,Rake,trees",http://art-collections.museum.ucsb.edu/files/original/38d059c96295dacfbf06911d87f2d966.jpg,"Physical Object","<strong>The Carolyn and Edwin Gledhill Photography Collection</strong>",1,0