﻿"Dublin Core:Title","Dublin Core:Description","Dublin Core:Date","Dublin Core:Creator","Dublin Core:Source","Dublin Core:Identifier","Dublin Core:Contributor","Dublin Core:Rights","Dublin Core:Relation","Dublin Core:Format","Dublin Core:Language","Dublin Core:Type","Dublin Core:Coverage","Dublin Core:Subject","Dublin Core:Publisher","Item Type Metadata:Birth Date","Item Type Metadata:Birthplace","Item Type Metadata:Event Type","Item Type Metadata:Participants","Item Type Metadata:URL","Item Type Metadata:Death Date","Item Type Metadata:Occupation","Item Type Metadata:Biographical Text","Item Type Metadata:Bibliography","Item Type Metadata:File name","Item Type Metadata:Time Summary","Item Type Metadata:Interviewer","Item Type Metadata:Interviewee","Item Type Metadata:Location","Item Type Metadata:Transcription","Item Type Metadata:Local URL","Item Type Metadata:Original Format","Item Type Metadata:Physical Dimensions","Item Type Metadata:Duration","Item Type Metadata:Compression","Item Type Metadata:Producer","Item Type Metadata:Director","Item Type Metadata:Bit Rate/Frequency","Item Type Metadata:Text","Item Type Metadata:Email Body","Item Type Metadata:Subject Line","Item Type Metadata:From","Item Type Metadata:To","Item Type Metadata:CC","Item Type Metadata:BCC","Item Type Metadata:Number of Attachments","Item Type Metadata:Standards","Item Type Metadata:Objectives","Item Type Metadata:Materials","Item Type Metadata:Tags",tags,file,itemType,collection,public,featured
"<strong>Artist unknown, Indian</strong>","<em>Bowl</em>, n.d.",n.d.,"<strong>Artist unknown, Indian</strong>",,1968.91,,,,,,,,,,,,,,,,,,,,,,,,,,,,,,,,,,,,,,,,,,,,,"bowl,Bronze,Figure,India,man,Sculpture,still life",http://art-collections.museum.ucsb.edu/files/original/2a4b762d5bc74d308a0b56fbc65aa290.jpg,"Physical Object","<strong>The Arts of Asia</strong>",1,0
<strong>Cameroon</strong>,<em>Bowl</em>,"20th C.",<strong>Cameroon</strong>,"Gift of Katharine W. Tremaine",1985.84,,,,,,,,,,,,,,,,,,,,,,,,,,,,,,,,,,,,,,,,,,,,,"bowl,Carved,Sculpture,still life,Wood",http://art-collections.museum.ucsb.edu/files/original/d7d4c09a20481ac156c0accd4cb0d5f0.jpg,"Physical Object","<strong>The Arts of Africa</strong>",1,0
<strong>ISLAMIC</strong>,<em>Bowl</em>,"late 16th C.",Islamic,,1968.76,,,,,,,,,,,,,,,,,,,,,,,,,,,,,,,,,,,,,,,,,,,,,"Blue,bowl,ceramic,glaze,motif,Sculpture,still life",http://art-collections.museum.ucsb.edu/files/original/b4006b03e19e3c8739d67cd2a0c71963.jpg,,"<strong>The Arts of the Middle East </strong>",1,0
<strong>ISLAMIC</strong>,<em>Bowl</em>,n.d.,"Middle East","Grace H. Dreyfus Collection",1983.5,,,,,,,,,,,,,,,,,,,,,,,,,,,,,,,,,,,,,,,,,,,,,"bowl,Bronze,Islamic,Sculpture,still life",http://art-collections.museum.ucsb.edu/files/original/370f2c74fc03238aa37e19ea783cbd47.jpg,,"<strong>The Arts of the Middle East </strong>",1,0
"<strong>ISLAMIC</strong>, Afghanistan","<em>Medicine bowl</em>","16th C.","Islamic, Afghanistan",,1968.84,,,,,,,,,,,,,,,,,,,,,,,,,,,,,,,,,,,,,,,,,,,,,"Afghanistan,bowl,Bronze,medicine,Sculpture,still life",http://art-collections.museum.ucsb.edu/files/original/f9b173e4c0356566e5ad360f69b7a61e.jpg,,"<strong>The Arts of the Middle East </strong>",1,0
"<strong>ISLAMIC</strong>, Iran",<em>Bowl</em>,"ca. 16th C.?","Islamic, Iran",,1968.71,,,,,,,,,,,,,,,,,,,,,,,,,,,,,,,,,,,,,,,,,,,,,"bowl,Bronze,floral,motif,Sculpture,still life",http://art-collections.museum.ucsb.edu/files/original/3b5e1d18bf802b9e20b6d29d2d7f5fac.jpg,,"<strong>The Arts of the Middle East </strong>",1,0
"<strong>ISLAMIC</strong>, Iran","<em>Bowl with incised and engraved decoration</em>","17th-18th C.",Iran,,1968.72,,,,,,,,,,,,,,,,,,,,,,,,,,,,,,,,,,,,,,,,,,,,,"bowl,floral,Iran,motif,script,Sculpture,still life",http://art-collections.museum.ucsb.edu/files/original/049991eec9025388b1f6244a8427fbcc.jpg,,"<strong>The Arts of the Middle East </strong>",1,0
"<strong>ISLAMIC</strong>, Iran",<em>Bowl</em>,"17th C.",Iran,"Grace H. Dreyfus Collection",1971.57,,,,,,,,,,,,,,,,,,,,,,,,,,,,,,,,,,,,,,,,,,,,,"bowl,ceramic,glaze,Iran,Sculpture,still life",http://art-collections.museum.ucsb.edu/files/original/a1fbcbdaf2b77ca9311190b7dca8c3e1.jpg,,"<strong>The Arts of the Middle East </strong>",1,0
"<strong>ISLAMIC</strong>, Iran",<em>Bowl</em>,n.d.,Iran,"Grace H. Dreyfus Collection",1971.84,,,,,,,,,,,,,,,,,,,,,,,,,,,,,,,,,,,,,,,,,,,,,"bowl,ceramic,Iran,motif,Sculpture,still life",http://art-collections.museum.ucsb.edu/files/original/2876f54ea24be61f4b83a8f51aba869e.jpg,,"<strong>The Arts of the Middle East </strong>",1,0
"<strong>ISLAMIC</strong>, Iran",<em>Bowl</em>,n.d.,Iran,"Grace H. Dreyfus Collection",1981.118,,,,,,,,,,,,,,,,,,,,,,,,,,,,,,,,,,,,,,,,,,,,,"bowl,ceramic,geometric,glaze,Iran,Sculpture,still life",http://art-collections.museum.ucsb.edu/files/original/e06a23f60f9ac9c61320e1d71ba3c7f3.JPG,,"<strong>The Arts of the Middle East </strong>",1,0
"<strong>ISLAMIC</strong>, Iran, Amlash","<em>Deep bowl</em>","1200-800 BCE",Persian,"Gift of Mr. and Mrs. Leon Wolcott",1971.151,,,,,,,,,,,,,,,,,,,,,,,,,,,,,,,,,,,,,,,,,,,,,"bowl,clay,Iran,Sculpture,still life",http://art-collections.museum.ucsb.edu/files/original/b10dd6539034d515ec70b300bf7c9dbb.jpg,,"<strong>The Arts of the Middle East </strong>",1,0
"<strong>ISLAMIC</strong>, Iran, Amol or Sari",<em>Bowl</em>,"10th - 11th C.","ISLAMIC, Iran, Amol or Sari","Grace H. Dreyfus Collection",1981.119,,,,,,,,,,,,,,,,,,,,,,,,,,,,,,,,,,,,,,,,,,,,,"bowl,ceramic,glaze,Iran,Sculpture,still life",http://art-collections.museum.ucsb.edu/files/original/e989efaebc5ba579091d98f59f5b1d12.JPG,,"<strong>The Arts of the Middle East </strong>",1,0
"<strong>ISLAMIC</strong>, Iran, Isfahan, Kashan",<em>Bowl</em>,n.d.,"Iran, Kashan","Grace H. Dreyfus Collection",1971.78,,,,,,,,,,,,,,,,,,,,,,,,,,,,,,,,,,,,,,,,,,,,,"bowl,Bronze,Iran,Sculpture,still life",http://art-collections.museum.ucsb.edu/files/original/acc4213e31b95a33f4b8b3cf27b42c26.jpg,,"<strong>The Arts of the Middle East </strong>",1,0
"<strong>ISLAMIC</strong>, Iran, Nishapur",<em>Bowl</em>,"10th - 12th C.","ISLAMIC, Iran, Nishapur","Grace H. Dreyfus Collection",1981.121,,,,,,,,,,,,,,,,,,,,,,,,,,,,,,,,,,,,,,,,,,,,,"bowl,ceramic,dish,glaze,Iran,Sculpture,still life,turquoise",http://art-collections.museum.ucsb.edu/files/original/11f72cbd8e36d037138ee6bfaa8fec03.jpg,,"<strong>The Arts of the Middle East </strong>",1,0
"<strong>ISLAMIC</strong>, Iran, Safavid","<em>Bowl with floral medallion</em>","18th C.","ISLAMIC, Iran, Safavid","Found in the collection",2015.005.001,,,,,,,,,,,,,,,,,,,,,,,,,,,,,,,,,,,,,,,,,,,,,"bowl,ceramic,flower,glaze,Iran,Sculpture,still life",http://art-collections.museum.ucsb.edu/files/original/73dd95a0fac2ca5b94df217d37c3cfad.jpg,,"<strong>The Arts of the Middle East </strong>",1,0
"<strong>ISLAMIC</strong>, Iran, Seljuk",<em>Bowl</em>,"12th c.","Iran, Seljuk period, 11th-12th C.","Grace H. Dreyfus Collection",1971.75,,,,,,,,,,,,,,,,,,,,,,,,,,,,,,,,,,,,,,,,,,,,,"bowl,fragments,Iran,Sculpture,still life",http://art-collections.museum.ucsb.edu/files/original/5292a605f03d5748beb6a3591ba51d8f.jpg,,"<strong>The Arts of the Middle East </strong>",1,0
"<strong>ISLAMIC</strong>, Iran, Seljuk","<em>Small lusterware bowl</em>","ca. 11th - 12th C.","ISLAMIC, Iran, Saveh","Grace H. Dreyfus Collection",1981.120,,,,,,,,,,,,,,,,,,,,,,,,,,,,,,,,,,,,,,,,,,,,,"animals,bowl,ceramic,dish,glaze,Iran,iron oxide,Sculpture,still life",http://art-collections.museum.ucsb.edu/files/original/76ea358b6d5904c5ba4b35aaea9468a0.jpg,,"<strong>The Arts of the Middle East </strong>",1,0
<strong>LURISTAN</strong>,<em>Bowl</em>,"ca. 1200-800 B.C.",Luristan,"Grace H. Dreyfus Collection",1968.45,,,,,,,,,,,,,,,,,,,,,,,,,,,,,,,,,,,,,,,,,,,,,"bowl,Bronze,Luristan,Sculpture,still life",http://art-collections.museum.ucsb.edu/files/original/f61e4be87f5e13a11d082082c9279fbf.jpg,"Physical Object","<strong>The Arts of the Middle East </strong>",1,0
"<strong>Maker unknown, Arizona, White Mountain Apache</strong>","<em>Shallow Bowl</em>","late 19th C.","<strong>Maker unknown, Arizona, White Mountain Apache</strong>","F. May Young Collection, given by Luella D. Saxby",1965.26,,,,,,,,,,,,,,,,,,,,,,,,,,,,,,,,,,,,,,,,,,,,,"19th century,bowl,still life,Textile,Woven",http://art-collections.museum.ucsb.edu/files/original/dbae1ce16680047d182fc76b64890c5c.JPG,"Physical Object","<p><strong>The Arts of Indigenous North America</strong></p>",1,0
"<strong>Maker unknown, New Guinea, Middle Sepik River</strong>",<em>Bowl</em>,n.d.,"<strong>Maker unknown, New Guinea, Middle Sepik River</strong>","Gift of UCSB Art Affiliates",1969.92,,,,,,,,,,,,,,,,,,,,,,,,,,,,,,,,,,,,,,,,,,,,,"bowl,ceramic,New Guinea,Sculpture,still life",http://art-collections.museum.ucsb.edu/files/original/d0a2e44820119b62f163638f7697175f.jpg,"Physical Object","<strong>Oceanic Arts</strong>",1,0
"<strong>Maker unknown, New Mexico, Isleta Pueblo, Rio Grande Valley</strong>",<em>Bowl</em>,"20th C.","<strong>Maker unknown, New Mexico, Isleta Pueblo, Rio Grande Valley</strong>","Gift of Mrs. William T. Campbell",1969.250.c,,,,,,,,,,,,,,,,,,,,,,,,,,,,,,,,,,,,,,,,,,,,,"bowl,ceramic,Pueblo,Sculpture,still life",http://art-collections.museum.ucsb.edu/files/original/e4b37af2966dc4029248dd6953749787.jpg,"Physical Object","<p><strong>The Arts of Indigenous North America</strong></p>",1,0
"<strong>Maker unknown, New Mexico, Santo Domingo Pueblo, Rio Grande Valley</strong>",<em>Bowl</em>,"20th C.","<strong>Maker unknown, New Mexico, Santo Domingo Pueblo, Rio Grande Valley</strong>","Gift of Mrs. William T. Campbell",1969.250.a,,,,,,,,,,,,,,,,,,,,,,,,,,,,,,,,,,,,,,,,,,,,,"bowl,ceramic,Pueblo,Sculpture,still life",http://art-collections.museum.ucsb.edu/files/original/ae718db6cc71aae06c7f463adb7ac5c4.jpg,"Physical Object","<p><strong>The Arts of Indigenous North America</strong></p>",1,0
"<strong>Maker unknown, New Mexico, Zuni Pueblo</strong>",<em>Bowl</em>,"20th C.","<strong>Maker unknown, New Mexico, Zuni Pueblo</strong>","Gift of Mrs. William T. Campbell",1969.250.e,,,,,,,,,,,,,,,,,,,,,,,,,,,,,,,,,,,,,,,,,,,,,"20th century,bowl,ceramic,Pueblo,Sculpture,still life",http://art-collections.museum.ucsb.edu/files/original/27c11dc7c59cbbf59fa31c79c6c7661e.jpg,"Physical Object","<p><strong>The Arts of Indigenous North America</strong></p>",1,0
"<strong>Maker unknown, Pueblo</strong>",<em>Bowl</em>,"20th C.","<strong>Maker unknown, Pueblo</strong>","Gift of Mrs. William T. Campbell",1969.250.b,,,,,,,,,,,,,,,,,,,,,,,,,,,,,,,,,,,,,,,,,,,,,"bowl,ceramic,Pueblo,Sculpture,still life",http://art-collections.museum.ucsb.edu/files/original/09ffe285df3919fcaebd78818d817047.jpg,"Physical Object","<p><strong>The Arts of Indigenous North America</strong></p>",1,0
"<strong>Maker unknown, S. Arizona, Papago</strong>","<em>Shallow bowl</em>","20th C.","<strong>Maker unknown, S. Arizona, Papago</strong>","Gift of Mrs. William T. Campbell",1969.239.1,,,,,,,,,,,,,,,,,,,,,,,,,,,,,,,,,,,,,,,,,,,,,"bowl,Circle,leaf,still life,Textile,Woven",http://art-collections.museum.ucsb.edu/files/original/5731ccdca7fdb5523bcb164e22edb522.jpg,"Physical Object","<p><strong>The Arts of Indigenous North America</strong></p>",1,0
"<strong>Maker unknown</strong>","<em>Potlatch Bowl in the Form of a Seal</em>","late 20th C.","<strong>Maker unknown</strong>","Gift of Mr. and Mrs. John A. Dedola",1981.33,,,,,,,,,,,,,,,,,,,,,,,,,,,,,,,,,,,,,,,,,,,,,"bowl,Figurative,potlatch,Sculpture,seal,still life,Wood",http://art-collections.museum.ucsb.edu/files/original/5666a9bc0ee30d05902e5a61d03599d1.jpg,"Physical Object","<p><strong>The Arts of Indigenous North America</strong></p>",1,0
<strong>MEXICAN</strong>,"<em>Sugar Bowl</em>",n.d.,"Mexican, Artist Unknown","Gift of Julia Emerson",1984.7,,,,,,,,,,,,,,,,,,,,,,,,,,,,,,,,,,,,,,,,,,,,,"bowl,Mexican,Sculpture,silver,still life",http://art-collections.museum.ucsb.edu/files/original/73213066e51473c833d0f6c660b301f0.jpg,"Physical Object","<strong>The Arts of Latin America</strong>",1,0
"<strong>Mexico, Guerrero</strong>","<em>Mulcajete Bowl</em>",n.d.,"<strong>Mexico, Guerrero</strong>","Caroline Tarbell Tupper Collection of Pre-Columbian Art",1999.165,,,,,,,,,,,,,,,,,,,,,,,,,,,,,,,,,,,,,,,,,,,,,"abstract,bowl,painted,Pre-Columbian,Sculpture",http://art-collections.museum.ucsb.edu/files/original/d4b214f06e83c429175b75a110abe667.jpg,"Physical Object","<strong>The Arts of Ancient Mesoamerica</strong>",1,0
"<strong>Olowe of Ise, Ikere village, Ekiti region, Nigeria</strong>","<em>Kneeling figure holding a bowl</em>","19-20th C.","<strong>Olowe of Ise, Ikere village, Ekiti region, Nigeria</strong>","Gift of Ceil and Michael Pulitzer",2011.007.013,,,,,,,,,,,,,,,,,,,,,,,,,,,,,,,,,,,,,,,,,,,,,"bowl,Female,Figurative,Figure,Sculpture,Wood","http://art-collections.museum.ucsb.edu/files/original/0f465e8dba6d3d56c4304e8e952562ff.jpg,http://art-collections.museum.ucsb.edu/files/original/8194583c9a5656c562f61b602bb3716b.jpg,http://art-collections.museum.ucsb.edu/files/original/db402a62b39ab3208448597d4ec27da1.jpg,http://art-collections.museum.ucsb.edu/files/original/9146451d4126d7a07d15541e7c9e0ec7.jpg","Physical Object","<strong>The Arts of Africa</strong>",1,0
"<strong>South America, Peru, Central coast</strong>",<em>Bowl</em>,"ca. 900 - 1300","<strong>South America, Peru, Central coast</strong>","Grace H. Dreyfus Collection",1968.51,,,,,,,,,,,,,,,,,,,,,,,,,,,,,,,,,,,,,,,,,,,,,"bowl,Peruvian,physical object,Pre-Columbian,Sculpture,utility",http://art-collections.museum.ucsb.edu/files/original/f15213251ffd5f99bd79cdb5a6c4a4c9.jpg,"Physical Object","<strong>The Arts of Ancient South America</strong>",1,0
"<strong>Tallensi, N Ghana</strong>","<em>Pipe Bowl</em>",n.d.,"<strong>Tallensi, N Ghana</strong>","Gift of John and Andrea Rich",1987.47,,,,,,,,,,,,,,,,,,,,,,,,,,,,,,,,,,,,,,,,,,,,,"bowl,Figurative,pipe,Sculpture,terracotta",http://art-collections.museum.ucsb.edu/files/original/ac1a7e0bfb2dc19dd4e6121a5cd0345b.jpg,"Physical Object","<strong>The Arts of Africa</strong>",1,0
"<strong>West Mexico, Nayarit</strong>","<em>Standing Female with bowl</em>","ca. 300 BCE - 300 CE","<strong>West Mexico, Nayarit</strong>",,1963.86,,,,,,,,,,,,,,,,,,,,,,,,,,,,,,,,,,,,,,,,,,,,,"bowl,ear-spool,Female,Figurative,Pre-Columbian,Sculpture",http://art-collections.museum.ucsb.edu/files/original/482ed147621529c045b311b01d4edde5.jpg,"Physical Object","<strong>The Arts of Ancient Mesoamerica</strong>",1,0
