﻿"Dublin Core:Title","Dublin Core:Description","Dublin Core:Date","Dublin Core:Creator","Dublin Core:Source","Dublin Core:Identifier","Dublin Core:Contributor","Dublin Core:Rights","Dublin Core:Relation","Dublin Core:Format","Dublin Core:Language","Dublin Core:Type","Dublin Core:Coverage","Dublin Core:Subject","Dublin Core:Publisher","Item Type Metadata:Birth Date","Item Type Metadata:Birthplace","Item Type Metadata:Event Type","Item Type Metadata:Participants","Item Type Metadata:URL","Item Type Metadata:Death Date","Item Type Metadata:Occupation","Item Type Metadata:Biographical Text","Item Type Metadata:Bibliography","Item Type Metadata:File name","Item Type Metadata:Time Summary","Item Type Metadata:Interviewer","Item Type Metadata:Interviewee","Item Type Metadata:Location","Item Type Metadata:Transcription","Item Type Metadata:Local URL","Item Type Metadata:Original Format","Item Type Metadata:Physical Dimensions","Item Type Metadata:Duration","Item Type Metadata:Compression","Item Type Metadata:Producer","Item Type Metadata:Director","Item Type Metadata:Bit Rate/Frequency","Item Type Metadata:Text","Item Type Metadata:Email Body","Item Type Metadata:Subject Line","Item Type Metadata:From","Item Type Metadata:To","Item Type Metadata:CC","Item Type Metadata:BCC","Item Type Metadata:Number of Attachments","Item Type Metadata:Standards","Item Type Metadata:Objectives","Item Type Metadata:Materials","Item Type Metadata:Tags",tags,file,itemType,collection,public,featured
"<strong>Islamic</strong>, Iran, Amlash","<em>Jug with handle</em>",n.d.,"<strong>Islamic</strong>, Iran, Amlash","Gift of Mr. and Mrs. Leon Wolcott",1971.148,,,,,,,,,,,,,,,,,,,,,,,,,,,,,,,,,,,,,,,,,,,,,"brown,liquid,Sculpture,still life,vessel",http://art-collections.museum.ucsb.edu/files/original/0f5e7dc1fe2263378f83765f53b69c40.jpg,,"<strong>The Arts of the Middle East </strong>",1,0
"<strong>AFRICAN</strong>, Sierra Leone, Mende people","<em>Moon shaped seat</em>",n.d.,"<strong>AFRICAN</strong>, Sierra Leone, Mende people","Gift of Harold and Nancy Carr",2021.011.003,,,,,,,,,,,,,,,,,,,,,,,,,,,,,,,,,,,,,,,,,,,,,"brown,Chair,Pole,Sculpture,still life",http://art-collections.museum.ucsb.edu/files/original/39d88f7e52ebbf69d95cbe4924b49c49.JPG,,"<strong>The Arts of Africa</strong>",1,0
"<strong>DAVIS</strong>, Gene","<em>Smithsonian Resident Associate Program</em>, 1975",1975,"<strong>DAVIS</strong>, Gene","Permanent Collection",1986.496,,,,,,,,,,,,,,,,,,,,,,,,,,,,,,,,,,,,,,,,,,,,,"1975,abstract,Blue,brown,green,lines,Lithographic Poster,pink,Promotional,Smithsonian Resident Associate Program,Tenth Anniversary,Works-on-Paper",http://art-collections.museum.ucsb.edu/files/original/bef7f15c217778aa0df5d203e9fe4b24.jpg,,"<strong>American and European Prints and Drawings post 1900</strong>",1,0
"<strong>Mexico; Central Veracruz, Remojades area</strong>","<em>Stone Club Head</em>","ca. 1500 BCE - 1519 CE","<strong>Mexico; Central Veracruz, Remojades area</strong>","Incoming Loan, Los Angeles County Museum of Art Gift of Constance McCormick Fearing",L2010.001.100,,,,,,,,,,,,,,,,,,,,,,,,,,,,,,,,,,,,,,,,,,,,,"brown,Pre-Columbian,Sculpture,stone,utility,weapon",http://art-collections.museum.ucsb.edu/files/original/e94aa2f3ad554c791422a71934bb1ba8.jpg,"Physical Object","<strong>The Arts of Ancient Mesoamerica</strong>",1,0
"<strong>West Mexico, Mezcala/Guerrero</strong>","<em>Standing Figure</em>","ca. 300 BCE - 300 CE","<strong>West Mexico, Mezcala/Guerrero</strong>","Caroline Tarbell Tupper Collection of Pre-Columbian Art",1986.395,,,,,,,,,,,,,,,,,,,,,,,,,,,,,,,,,,,,,,,,,,,,,"brown,Figurative,Sculpture,standing,stone",http://art-collections.museum.ucsb.edu/files/original/c4cb4e9f773c751cc69c236fb8eb107b.jpg,"Physical Object","<strong>The Arts of Ancient Mesoamerica</strong>",1,0
"<strong>Mexico; Central Veracruz, Remojades area</strong>","<em>Standing Figure</em>","ca. 1500 BCE - 1519 CE","<strong>Mexico; Central Veracruz, Remojades area</strong>","Incoming Loan, Los Angeles County Museum of Art Gift of Constance McCormick Fearing",L2010.001.150,,,,,,,,,,,,,,,,,,,,,,,,,,,,,,,,,,,,,,,,,,,,,"brown,Figurative,Sculpture,small,standing",http://art-collections.museum.ucsb.edu/files/original/e9d5e703c621aaba9d6905f84d0345d5.jpg,"Physical Object","<strong>The Arts of Ancient Mesoamerica</strong>",1,0
"<strong>Mexico, Mezcala</strong>","<em>Seated figure with knees raised</em>","700 BCE-650 CE","<strong>Mexico, Mezcala</strong>","Caroline Tarbell Tupper Collection of Pre-Columbian Art",2019.010.004,,,,,,,,,,,,,,,,,,,,,,,,,,,,,,,,,,,,,,,,,,,,,"brown,Limbs,Pre-Columbian,Sculpture,Sitting",http://art-collections.museum.ucsb.edu/files/original/a935bb85ddb8a57213686c1485031039.jpg,"Physical Object","<strong>The Arts of Ancient Mesoamerica</strong>",1,0
"<strong>Maker unknown, Acoma Pueblo</strong>",<em>Pot</em>,n.d.,"<strong>Acoma Pueblo</strong>","Gift of Pearl Chase",1965.2,,,,,,,,,,,,,,,,,,,,,,,,,,,,,,,,,,,,,,,,,,,,,"brown,ceramic,indigenous,pot,Sculpture,still life",http://art-collections.museum.ucsb.edu/files/original/477b57827645b773d6daa5e273fcbff2.jpg,,"<p><strong>The Arts of Indigenous North America</strong></p>",1,0
"<strong>VAN OFREN</strong>, Michael",<em>Untitled</em>,2004,"<strong>VAN OFREN</strong>, Michael","Gift of Marc Selwyn Fine Art, Beverly Hills",2018.017.014,,,,,,,,,,,,,,,,,,,,,,,,,,,,,,,,,,,,,,,,,,,,,"abstract,Black,Blue,brown,Painting",http://art-collections.museum.ucsb.edu/files/original/ba4806623f459eb65ad0b64be016d0da.jpg,"Physical Object",<strong>Paintings</strong>,1,0
"<strong>SMITH</strong>, Jim","<em>Portrait of Fran</em>","ca. 1990","<strong>SMITH</strong>, Jim","Estate of Frances Garvin and Keith Julius Puccinelli",2018.001.087,,,,,,,,,,,,,,,,,,,,,,,,,,,,,,,,,,,,,,,,,,,,,"Black,blonde,brown,Painting,portrait,woman",http://art-collections.museum.ucsb.edu/files/original/25fffaa813a7fd3c5a9b79a8a6113955.jpg,"Physical Object",<strong>Paintings</strong>,1,0
"<strong>EHRENBERG</strong>, Noah",<em>Untitled</em>,n.d.,"<strong>EHRENBERG</strong>, Noah","Gift of Phyllis Plous",1999.110,,,,,,,,,,,,,,,,,,,,,,,,,,,,,,,,,,,,,,,,,,,,,"abstract,brown,Drawing,Painting,purple,reds,Yellow",http://art-collections.museum.ucsb.edu/files/original/0a49fbe23a743f02a1c82b7856655bdb.jpg,"Physical Object",<strong>Paintings</strong>,1,0
"<strong>DE</strong> <strong>ERDELY</strong>, Francis",<em>Woodpecker</em>,1957,"<strong>DE ERDELY</strong>, Francis","Gift of Drs. J.W. and Sue Colin",2013.002.003,,,,,,,,,,,,,,,,,,,,,,,,,,,,,,,,,,,,,,,,,,,,,"abstract,bird,brown,Painting,tree trunk,Wood,woodpecker",http://art-collections.museum.ucsb.edu/files/original/c2dd379949ea6bdaa9649b764bc195d9.jpg,"Physical Object",<strong>Paintings</strong>,1,0
"<strong>LEVIN</strong>, Dan",<em>Mess</em>,2004,"<strong>LEVIN</strong>, Dan","Estate of Frances Garvin and Keith Julius Puccinelli",2018.001.061,,,,,,,,,,,,,,,,,,,,,,,,,,,,,,,,,,,,,,,,,,,,,"Bronze,brown,bullets,metal,Rust,Sculpture",http://art-collections.museum.ucsb.edu/files/original/184e9bf243d1fe853eb12485bb8e15ce.jpg,"Physical Object","<strong>Sculpture and Mixed Media</strong>",1,0
"<strong>JACOBSON</strong>, Jim","<em>Keyhole Mobile</em>",2010,"<strong>JACOBSON</strong>, Jim","Gift of Dr. and Mrs. Fima Lifshitz",2017.014.003,,,,,,,,,,,,,,,,,,,,,,,,,,,,,,,,,,,,,,,,,,,,,"abstract,brown,hanging,metal,mobile,paint,Sculpture",http://art-collections.museum.ucsb.edu/files/original/85550b14cbd4507b84a9bed72dceba96.jpg,"Physical Object","<strong>Sculpture and Mixed Media</strong>",1,0
"<strong>LASSAW</strong>, Ibram",<em>Untitled</em>,1950,"<strong>LASSAW</strong>, Ibram","Gift of Lynn K. Altman Family Trust",2017.007.010,,,,,,,,,,,,,,,,,,,,,,,,,,,,,,,,,,,,,,,,,,,,,"Black,brown,burlap,grid,Ink,Linear,linen",http://art-collections.museum.ucsb.edu/files/original/f2f931b76e3b36d580a3fc1a2c63a6d0.jpg,"Physical Object","<strong>The Arts of the Middle East </strong>",1,0
"<strong>PICASSO</strong>, Pablo","<em>Mat Wood-Owl</em>",1958,"<strong>PICASSO</strong>, Pablo","Gift of Lynn K. Altman Family Trust",2017.007.007,,,,,,,,,,,,,,,,,,,,,,,,,,,,,,,,,,,,,,,,,,,,,"animal,brown,ceramic,clay,earthenware,Owl,picasso,red,Sculpture,White",http://art-collections.museum.ucsb.edu/files/original/755a7ff7468106364b7f0a82bca0d383.jpg,"Physical Object","<strong>Sculpture and Mixed Media</strong>",1,0
"<strong>Artist unknown</strong>","<em>Relief of 2 figures, water, boat and volcano</em>",n.d.,"<strong>Artist unknown</strong>",,1973.243,,,,,,,,,,,,,,,,,,,,,,,,,,,,,,,,,,,,,,,,,,,,,"Boat,brown,Figurative,patina,plaster,Sculpture,volcano,water",,"Physical Object","<strong>Sculpture and Mixed Media</strong>",1,0
"<strong>MELLER</strong>, Peter",<em>Circe</em>,n.d,"Meller, Peter","Bea Farwell Bequest",2010.003.028,,,,,,,,,,,,,,,,,,,,,,,,,,,,,,,,,,,,,,,,,,,,,"animals,brown,portrait,woman,Works-on-Paper",http://art-collections.museum.ucsb.edu/files/original/97c0d482ed0619e191f806853ba43f50.jpg,"Physical Object","<strong>UCSB Alumni and Faculty</strong>",1,0
"<strong>MELLER</strong>, Peter","<em>Pippo + Renzo (Copy 1)</em>",n.d,"Meller, Peter","Bea Farwell Bequest",2010.003.026,,,,,,,,,,,,,,,,,,,,,,,,,,,,,,,,,,,,,,,,,,,,,"brown,figures,portrait,stamp,Works-on-Paper",http://art-collections.museum.ucsb.edu/files/original/793c012aad0a025ebcf3a5109c0aff74.jpg,"Physical Object","<strong>UCSB Alumni and Faculty</strong>",1,0
"<strong>MELLER</strong>, Peter",<em>Dancers</em>,n.d,"Meller, Peter","Bea Farwell Bequest",2010.003.021,,,,,,,,,,,,,,,,,,,,,,,,,,,,,,,,,,,,,,,,,,,,,"brown,dancer,figures,Ink,portrait,Works-on-Paper",http://art-collections.museum.ucsb.edu/files/original/dbc152e2d099a2b75ef99fe560f3b5cf.JPG,"Physical Object","<strong>UCSB Alumni and Faculty</strong>",1,0
"<strong>MELLER</strong>, Peter",<em>Kallipygmalion</em>,n.d,"Meller, Peter","Bea Farwell Bequest",2010.003.019,,,,,,,,,,,,,,,,,,,,,,,,,,,,,,,,,,,,,,,,,,,,,"brown,Ink,nude,standing,woman,Works-on-Paper",http://art-collections.museum.ucsb.edu/files/original/7f155a72280236c03dec3b1ea1faaba8.jpg,"Physical Object","<strong>UCSB Alumni and Faculty</strong>",1,0
"<strong>PEARSH</strong>, Kevin","<em>Hammersley Landscape</em>","c. 1980","Pearsh, Kevin","Margaret Mallory Bequest",1999.26,,,,,,,,,,,,,,,,,,,,,,,,,,,,,,,,,,,,,,,,,,,,,"abstract-landscape,aquatint,brown,Hammersley,landscape,Works-on-Paper",http://art-collections.museum.ucsb.edu/files/original/6409740e69d8ad6f7859c34b8c95cdbd.jpg,"Physical Object","<strong>The Margaret Mallory Bequest</strong>",1,0
"<strong>BROWN</strong>, Laurie","<em>Land Curvature No. 7</em>",1978,"Brown, Laurie","Ruth S. Schaffner Collection",1986.574,,,,,,,,,,,,,,,,,,,,,,,,,,,,,,,,,,,,,,,,,,,,,"20th century,abstract,brown,Gelatin Silver,photograph,toned",http://art-collections.museum.ucsb.edu/files/original/064eb816fcd815d2b560734542771025.jpg,"Physical Object","<strong>The Ruth S. Schaffner Collection</strong>",1,0
<strong>ISLAMIC</strong>,"<em>Tear Bottle</em>","ca. 9-10th century C.E.","Middle East","Grace H. Dreyfus Collection",1971.77.3,,,,,,,,,,,,,,,,,,,,,,,,,,,,,,,,,,,,,,,,,,,,,"bottle,brown,glass,Islamic,Sculpture,still life",http://art-collections.museum.ucsb.edu/files/original/f3f5251d8a4650d0a5ff3a53e9308674.jpg,,"<strong>The Arts of the Middle East </strong>",1,0
"<strong>LUNGREN</strong>, Fernand","<em>The Hopi Snake Dancers</em>",1919,"<strong>LUNGREN</strong>, Fernand","Gift of John McGowan",1984.13,,,,,,,,,,,,,,,,,,,,,,,,,,,,,,,,,,,,,,,,,,,,,"20th century,abstract,brown,distressed,Painting",http://art-collections.museum.ucsb.edu/files/original/1e2f972941c91ab3a8474f0fe9df1641.jpg,"Physical Object","<strong>The Fernand Lungren Bequest</strong>",1,0
"<p><strong>VAN DYCK</strong>, Anthony (Circle of)</p>","<p><em>Resurrection of Lazarus</em></p>",n.d.,"<p><strong>VAN DYCK</strong>, Anthony (Circle of), b. Antwerp, 1599 - 1641</p>","<p>Gift of the Lorser Feitelson and Helen Lundeberg Feitelson Arts Foundation</p>",<p>1985.148</p>,,,,,,,,,,,,,,,,,,,,,,,,,,,,,,,,,,,,,,,,,,,,,"brown,Figurative,Resurrection,Sketch,Works-on-Paper",http://art-collections.museum.ucsb.edu/files/original/e1151d0f928bcf48c3a3bbaf059a5bff.jpg,Dataset,"<strong>The Feitelson Collection of Old Master Drawings</strong>",1,0
