﻿"Dublin Core:Title","Dublin Core:Description","Dublin Core:Date","Dublin Core:Creator","Dublin Core:Source","Dublin Core:Identifier","Dublin Core:Contributor","Dublin Core:Rights","Dublin Core:Relation","Dublin Core:Format","Dublin Core:Language","Dublin Core:Type","Dublin Core:Coverage","Dublin Core:Subject","Dublin Core:Publisher","Item Type Metadata:Birth Date","Item Type Metadata:Birthplace","Item Type Metadata:Event Type","Item Type Metadata:Participants","Item Type Metadata:URL","Item Type Metadata:Death Date","Item Type Metadata:Occupation","Item Type Metadata:Biographical Text","Item Type Metadata:Bibliography","Item Type Metadata:File name","Item Type Metadata:Time Summary","Item Type Metadata:Interviewer","Item Type Metadata:Interviewee","Item Type Metadata:Location","Item Type Metadata:Transcription","Item Type Metadata:Local URL","Item Type Metadata:Original Format","Item Type Metadata:Physical Dimensions","Item Type Metadata:Duration","Item Type Metadata:Compression","Item Type Metadata:Producer","Item Type Metadata:Director","Item Type Metadata:Bit Rate/Frequency","Item Type Metadata:Text","Item Type Metadata:Email Body","Item Type Metadata:Subject Line","Item Type Metadata:From","Item Type Metadata:To","Item Type Metadata:CC","Item Type Metadata:BCC","Item Type Metadata:Number of Attachments","Item Type Metadata:Standards","Item Type Metadata:Objectives","Item Type Metadata:Materials","Item Type Metadata:Tags",tags,file,itemType,collection,public,featured
"<strong>Artist unknown, Indian</strong>","<i>Portrait of Rajasthan, </i>19th C.","19th C.","Artist unknown, Indian","Gift of Mrs. Hamilton von Breton",1972.180.2,,,,,,,,,,,,,,,,,,,,,,,,,,,,,,,,,,,,,,,,,,,,,"color,Drawing,India,portrait,Works-on-Paper",http://art-collections.museum.ucsb.edu/files/original/ab214f603a216472395d53f561780aa0.jpg,"Physical Object","<strong>The Arts of Asia</strong>",1,0
"<strong>Artist unknown, Indian</strong>","19th C.","19th C.","<strong>Artist unknown, Indian</strong>","Gift of Mrs. Hamilton von Breton",1972.180.1,,,,,,,,,,,,,,,,,,,,,,,,,,,,,,,,,,,,,,,,,,,,,"color,Drawing,India,portrait,Works-on-Paper",http://art-collections.museum.ucsb.edu/files/original/1db34f9a36d59fc79e96b1de6f142860.jpg,"Physical Object","<strong>The Arts of Asia</strong>",1,0
"<strong>Artist unknown, Japanese</strong>","<em>Ladies Writing</em>, color print",n.d.,"<strong>Artist unknown, Japanese</strong>",,1970.73.2,,,,,,,,,,,,,,,,,,,,,,,,,,,,,,,,,,,,,,,,,,,,,"color,Japan,portrait,print,women,Works-on-Paper",http://art-collections.museum.ucsb.edu/files/original/0665706a200dd15aa58babc9d276d1af.jpg,"Physical Object","<strong>The Arts of Asia</strong>",1,0
"<strong>Artist unknown, Japanese</strong>","<em>Ladies Writing</em>, color print",n.d.,"<strong>Artist unknown, Japanese</strong>",,1970.73.1,,,,,,,,,,,,,,,,,,,,,,,,,,,,,,,,,,,,,,,,,,,,,"color,Japan,portrait,print,women,Works-on-Paper",http://art-collections.museum.ucsb.edu/files/original/165113d742217618ac35dd30d5f2d78d.jpg,"Physical Object","<strong>The Arts of Asia</strong>",1,0
"<strong>HIROSHIGE</strong>, Ando","<em>Fishermen in Tosa Provinc</em>e, 1857","ca. 1857","<strong>HIROSHIGE</strong>, Ando","Gift of E. Bruce Robertson and Thom Kren",2000.45,,,,,,,,,,,,,,,,,,,,,,,,,,,,,,,,,,,,,,,,,,,,,"color,fisherman,Japan,portrait,Sculpture,seascape,woodcut,Works-on-Paper",http://art-collections.museum.ucsb.edu/files/original/d8edb2064f8cbfc73cafeeab60bea9f1.jpg,"Physical Object","<strong>The Arts of Asia</strong>",1,0
"<strong>TOYURIKI</strong>, Tomikichiro","<em>Historic Bridge</em>, 1930",1930,"<strong>TOYURIKI</strong>, Tomikichiro",,1986.554,,,,,,,,,,,,,,,,,,,,,,,,,,,,,,,,,,,,,,,,,,,,,"bridge,color,Japan,landscape,seascape,woodcut,Works-on-Paper",http://art-collections.museum.ucsb.edu/files/original/f0b36f0cfe49ce23e74d6a2e50c2498b.jpg,"Physical Object","<strong>The Arts of Asia</strong>",1,0
"<strong>FIERRO</strong>, Michelle",<em>Untitled</em>,1998,"<strong>FIERRO</strong>, Michelle","Museum purchase",2000.61,,,,,,,,,,,,,,,,,,,,,,,,,,,,,,,,,,,,,,,,,,,,,"abstract,color,dark,figures,Painting,pastel,Pencil",http://art-collections.museum.ucsb.edu/files/original/ecef1e70d23d8ec5ac542f991a26fd10.jpg,"Physical Object",<strong>Paintings</strong>,1,0
"<strong>BESEMER</strong>, Linda","<em>Multi Bulge Sheet No. 2</em>",2004,"<strong>BESEMER</strong>, Linda","Gift of Laurence Eisenstein and Robin Zimelman",2018.024.001,,,,,,,,,,,,,,,,,,,,,,,,,,,,,,,,,,,,,,,,,,,,,"abstract,bulging,color,dark,grey,illusion,lines,Painting",http://art-collections.museum.ucsb.edu/files/original/ed11f73fdf659221005a40f57dd03d89.jpg,"Physical Object",<strong>Paintings</strong>,1,0
"<strong>CLICK</strong>, Bob","<em>Circled Square Encircled</em>",1968,"<strong>CLICK</strong>, Bob","UCSB Art Affiliates",1970.42,,,,,,,,,,,,,,,,,,,,,,,,,,,,,,,,,,,,,,,,,,,,,"abstract,architecture,color,line,red",http://art-collections.museum.ucsb.edu/files/original/f6c55d985a52a3a64ac768e5755308d9.jpg,"Physical Object","<strong>American and European Prints and Drawings post 1900</strong>",1,0
"<strong>MELLER</strong>, Peter","<em>16 Photographs of Various Locations</em>",1960,"Meller, Peter","Bea Farwell Bequest",S2010.003.051,,,,,,,,,,,,,,,,,,,,,,,,,,,,,,,,,,,,,,,,,,,,,"color,Italy,landscape,photograph,Santa Barbara,still life",http://art-collections.museum.ucsb.edu/files/original/6de7593d49177e0a12dc2d3d1ca36648.jpg,"Physical Object","<strong>UCSB Alumni and Faculty</strong>",1,0
"<strong>MATSUMOTO</strong>, Noboru","<em>Special Edition Came Out</em>",1964,"<strong>MATSUMOTO</strong>, Noboru","Anonymous gift to the Ala Story Print Collection",1969.12,,,,,,,,,,,,,,,,,,,,,,,,,,,,,,,,,,,,,,,,,,,,,"abstract,color,print,square,woodcut,Works-on-Paper",http://art-collections.museum.ucsb.edu/files/original/ef36bcd83f2990e1c8e07dde6736f85a.jpg,"Physical Object","<strong>The Arts of Asia</strong>",1,0
"<strong>WARSHAW</strong>, Howard",Untitled,n.d.,"<strong>WARSHAW</strong>, Howard","Found in the Collection",2015.004.001,,,,,,,,,,,,,,,,,,,,,,,,,,,,,,,,,,,,,,,,,,,,,"color,Figurative,Figure,oil,Painting",http://art-collections.museum.ucsb.edu/files/original/9243f5b1a0100bd79b862015c931b7a7.jpg,"Physical Object","<strong>UCSB Alumni and Faculty</strong>",1,0
"<strong>RIVERS</strong>, Larry","<em>Portrait of Ed Gordon</em>",1969,"Rivers, Larry","Ruth S. Schaffner Collection",1986.59,,,,,,,,,,,,,,,,,,,,,,,,,,,,,,,,,,,,,,,,,,,,,"color,Lithograph,man,photograph,portrait,sepia",http://art-collections.museum.ucsb.edu/files/original/8d5d067c9c5c2942c92772ac1a288cea.jpg,"Physical Object","<strong>The Ruth S. Schaffner Collection</strong>",1,0
"<strong>WESTFALL</strong>, Stephen",<em>Argus</em>,2015,"<strong>WESTFALL</strong>, Stephen","Museum purchase",2015.011.001,,,,,,,,,,,,,,,,,,,,,,,,,,,,,,,,,,,,,,,,,,,,,"abstract,color,lines,Painting,wall",http://art-collections.museum.ucsb.edu/files/original/ad168409f4bdf172b478286f0556e36c.jpg,"Physical Object","<strong>UCSB Alumni and Faculty</strong>",1,0
"<strong>CALLISTER</strong>, Jane",<em>Perch</em>,2003,"<strong>CALLISTER</strong>, Jane","Gift of Laurence A. Rickels",2011.004.021,,,,,,,,,,,,,,,,,,,,,,,,,,,,,,,,,,,,,,,,,,,,,"abstract,acrylic,color,Painting,panel",http://art-collections.museum.ucsb.edu/files/original/c0e2bb92c9eb8c71c4edcf2f539aced3.jpg,"Physical Object","<strong>UCSB Alumni and Faculty</strong>",1,0
"<strong>WESTFALL</strong>, Stephen",<em>Argus</em>,2015,"<strong>WESTFALL</strong>, Stephen","Courtesy of the artist",2015.011.001,,,,,,,,,,,,,,,,,,,,,,,,,,,,,,,,,,,,,,,,,,,,,"abstract,color,geometric,Painting,wall",http://art-collections.museum.ucsb.edu/files/original/61476a5f0e3308350b3d2499b0b57382.jpg,"Physical Object","<strong>Outdoor Sculpture</strong>",1,0
