﻿"Dublin Core:Title","Dublin Core:Description","Dublin Core:Date","Dublin Core:Creator","Dublin Core:Source","Dublin Core:Identifier","Dublin Core:Contributor","Dublin Core:Rights","Dublin Core:Relation","Dublin Core:Format","Dublin Core:Language","Dublin Core:Type","Dublin Core:Coverage","Dublin Core:Subject","Dublin Core:Publisher","Item Type Metadata:Birth Date","Item Type Metadata:Birthplace","Item Type Metadata:Event Type","Item Type Metadata:Participants","Item Type Metadata:URL","Item Type Metadata:Death Date","Item Type Metadata:Occupation","Item Type Metadata:Biographical Text","Item Type Metadata:Bibliography","Item Type Metadata:File name","Item Type Metadata:Time Summary","Item Type Metadata:Interviewer","Item Type Metadata:Interviewee","Item Type Metadata:Location","Item Type Metadata:Transcription","Item Type Metadata:Local URL","Item Type Metadata:Original Format","Item Type Metadata:Physical Dimensions","Item Type Metadata:Duration","Item Type Metadata:Compression","Item Type Metadata:Producer","Item Type Metadata:Director","Item Type Metadata:Bit Rate/Frequency","Item Type Metadata:Text","Item Type Metadata:Email Body","Item Type Metadata:Subject Line","Item Type Metadata:From","Item Type Metadata:To","Item Type Metadata:CC","Item Type Metadata:BCC","Item Type Metadata:Number of Attachments","Item Type Metadata:Standards","Item Type Metadata:Objectives","Item Type Metadata:Materials","Item Type Metadata:Tags",tags,file,itemType,collection,public,featured
"<strong>DALLYN</strong>, Deborah","<em>Untitled</em>, 1997",1997,"<strong>DALLYN</strong>, Deborah","Women Beyond Borders Art Collection founded by Lorraine Serena",2023.005.424,,,,,,,,,,,,,,,,,,,,,,,,,,,,,,,,,,,,,,,,,,,,,"doll,Legs,portrait,Sculpture",http://art-collections.museum.ucsb.edu/files/original/500c17d9933d0730a70df76d24f745d9.jpg,,"<strong>Women Beyond Borders</strong>",1,0
"<strong>Yoruba, Nigeria</strong>",<em>Doll</em>,n.d.,"<strong>Yoruba, Nigeria</strong>","Gift of Mrs. Douglas Fraser",1987.75,,,,,,,,,,,,,,,,,,,,,,,,,,,,,,,,,,,,,,,,,,,,,"Carved,doll,Figurative,Sculpture,Wood","http://art-collections.museum.ucsb.edu/files/original/492217759aea543f502ca0b9cf9bd79c.jpg,http://art-collections.museum.ucsb.edu/files/original/4f5eb9dca3b8a360a3f63220a4c94072.jpg","Physical Object","<strong>The Arts of Africa</strong>",1,0
<strong>Gaung</strong>,<em>Doll</em>,n.d.,<strong>Gaung</strong>,"Gift of Professor Alfred Moir",1986.358,,,,,,,,,,,,,,,,,,,,,,,,,,,,,,,,,,,,,,,,,,,,,"Beads,doll,Figurative,Sculpture,toy,woman",http://art-collections.museum.ucsb.edu/files/original/e40cc8e4d492e8bbcaa88231084824dd.jpg,"Physical Object","<strong>The Arts of Africa</strong>",1,0
<strong>Botswanan</strong>,"<em>Tswana Rag Doll</em>","20th C.",<strong>Botswanan</strong>,,1999.42,,,,,,,,,,,,,,,,,,,,,,,,,,,,,,,,,,,,,,,,,,,,,"doll,fabric,Sculpture,Textile,toy",http://art-collections.museum.ucsb.edu/files/original/f0580ae42f6d067bbd60b86d82427ac9.jpg,"Physical Object","<strong>The Arts of Africa</strong>",1,0
"<strong>Asante, Ghana</strong>",<em>Doll</em>,n.d.,"<strong>Asante, Ghana</strong>","Gift of John and Andrea Rich",1986.431,,,,,,,,,,,,,,,,,,,,,,,,,,,,,,,,,,,,,,,,,,,,,"doll,Figurative,Sculpture,toy,Wood",http://art-collections.museum.ucsb.edu/files/original/4bb3e98463ae14c5b4bef2fcea6c2ffc.jpg,"Physical Object","<strong>The Arts of Africa</strong>",1,0
"<strong>East African</strong>","<em>Whistle Doll</em>",n.d.,"<strong>East African</strong>","Gift of Professor Alfred Moir",1986.355,,,,,,,,,,,,,,,,,,,,,,,,,,,,,,,,,,,,,,,,,,,,,"bamboo,Beads,doll,Sculpture,still life,string,Whistle",http://art-collections.museum.ucsb.edu/files/original/7adbcad52edfd3e64fe8355495f58bb3.jpg,"Physical Object","<strong>The Arts of Africa</strong>",1,0
<strong>Botswana</strong>,"<em>Tswana Rag Doll</em>","20th C.",<strong>Botswana</strong>,,1999.44,,,,,,,,,,,,,,,,,,,,,,,,,,,,,,,,,,,,,,,,,,,,,"doll,fabric,Figurative,Textile,toy",http://art-collections.museum.ucsb.edu/files/original/3032aefee536527353686cdbd9bdf685.jpg,"Physical Object","<strong>The Arts of Africa</strong>",1,0
<strong>Botswana</strong>,"<em>Tswana Rag Doll</em>","20th C.",<strong>Botswana</strong>,,1999.43,,,,,,,,,,,,,,,,,,,,,,,,,,,,,,,,,,,,,,,,,,,,,"doll,fabric,Figurative,Textile,toy",http://art-collections.museum.ucsb.edu/files/original/1bf66b342c733f870d6bdc45c2dd7ff7.jpg,"Physical Object","<strong>The Arts of Africa</strong>",1,0
<strong>Africa</strong>,<em>Doll</em>,n.d.,<strong>Africa</strong>,,1973.107,,,,,,,,,,,,,,,,,,,,,,,,,,,,,,,,,,,,,,,,,,,,,"Bead,doll,Figurative,plastic,Sculpture",http://art-collections.museum.ucsb.edu/files/original/de7c74de29cd9566620a30011513ba9e.jpg,"Physical Object","<strong>The Arts of Africa</strong>",1,0
"<strong>Artist unknown</strong>","<em>Portrait of Mary Kirtley Lamberton, 6 yrs.</em>","October 1881","<strong>Artist unknown</strong>","Gift of Mr. Keith Gledhill",1986.287,,,,,,,,,,,,,,,,,,,,,,,,,,,,,,,,,,,,,,,,,,,,,"black and white,cross necklace,doll,photograph,portrait,Young girl",http://art-collections.museum.ucsb.edu/files/original/307ac50424ac34806c01040d37de9f5c.jpg,"Physical Object","<strong>The Carolyn and Edwin Gledhill Photography Collection</strong>",1,0
"<strong>GLEDHILL</strong>, Carolyn and Edwin (attributed)","<em>#35 Boy in Nursery Holding Ball</em>","20th c.","<strong>GLEDHILL</strong>, Carolyn and Edwin (attributed)","Gift of Mr. Keith Gledhill",1986.137,,,,,,,,,,,,,,,,,,,,,,,,,,,,,,,,,,,,,,,,,,,,,"Baby,boy,doll,Nursery,photograph,portrait,Toys,Wallpaper",http://art-collections.museum.ucsb.edu/files/original/67bcf3874782b4023390526f93394c5e.jpg,"Physical Object","<strong>The Carolyn and Edwin Gledhill Photography Collection</strong>",1,0
