﻿"Dublin Core:Title","Dublin Core:Description","Dublin Core:Date","Dublin Core:Creator","Dublin Core:Source","Dublin Core:Identifier","Dublin Core:Contributor","Dublin Core:Rights","Dublin Core:Relation","Dublin Core:Format","Dublin Core:Language","Dublin Core:Type","Dublin Core:Coverage","Dublin Core:Subject","Dublin Core:Publisher","Item Type Metadata:Birth Date","Item Type Metadata:Birthplace","Item Type Metadata:Event Type","Item Type Metadata:Participants","Item Type Metadata:URL","Item Type Metadata:Death Date","Item Type Metadata:Occupation","Item Type Metadata:Biographical Text","Item Type Metadata:Bibliography","Item Type Metadata:File name","Item Type Metadata:Time Summary","Item Type Metadata:Interviewer","Item Type Metadata:Interviewee","Item Type Metadata:Location","Item Type Metadata:Transcription","Item Type Metadata:Local URL","Item Type Metadata:Original Format","Item Type Metadata:Physical Dimensions","Item Type Metadata:Duration","Item Type Metadata:Compression","Item Type Metadata:Producer","Item Type Metadata:Director","Item Type Metadata:Bit Rate/Frequency","Item Type Metadata:Text","Item Type Metadata:Email Body","Item Type Metadata:Subject Line","Item Type Metadata:From","Item Type Metadata:To","Item Type Metadata:CC","Item Type Metadata:BCC","Item Type Metadata:Number of Attachments","Item Type Metadata:Standards","Item Type Metadata:Objectives","Item Type Metadata:Materials","Item Type Metadata:Tags",tags,file,itemType,collection,public,featured
"<strong>WEGMAN</strong>, William",<em>Perch</em>,1989,"<strong>WEGMAN</strong>, William","Gift of Barry A. Berkus and Family",2006.002.021,,,,,,,,,,,,,,,,,,,,,,,,,,,,,,,,,,,,,,,,,,,,,"1980's,20th century,aquatic,etching,fish,Nature,Wood",http://art-collections.museum.ucsb.edu/files/original/57f83f4db76345fe7c43d2c6e68b7898.jpg,"Physical Object","<strong>The Barry Berkus Family Collection</strong>",1,0
"<strong>BIGGERS</strong>, Sanford","<em>Expose: Transolitude</em>",2008,"<strong>BIGGERS</strong>, Sanford","Gift of Exit Art, New York",2012.009.005.002,,,,,,,,,,,,,,,,,,,,,,,,,,,,,,,,,,,,,,,,,,,,,"abstract,Brushstroke,fish,geometric,Patterned,Unique Shape,Wave,Works-on-Paper",http://art-collections.museum.ucsb.edu/files/original/3444c67a5a49753ca8a05252c38e5935.jpg,"Physical Object","<strong>EXIT ART</strong>",1,0
"<strong>Artist unknown, Chinese</strong>","<em>Quan Yin, Master of Ferocious Beasts</em>","19th - 20th century","<strong>Artist unknown, Chinese</strong>","Thomas C. Pavia Collection of Daoist Gods",2012.004.067,,,,,,,,,,,,,,,,,,,,,,,,,,,,,,,,,,,,,,,,,,,,,"Beast,Daoist,Female,fish,Halo,ocean,Quan Yin,Religious,waves,White Robe,Works-on-Paper",http://art-collections.museum.ucsb.edu/files/original/5e5bb3539cbac3991fc44bcdf72d373f.jpg,"Physical Object","<strong>The Thomas C. Pavia Collection of Daoist Gods</strong>",1,0
"<strong>SCOTT, </strong>Charles","<em>Washington Beauties</em>",1973,"<strong>SCOTT</strong>, Charles","Gift of Professor Miles Varner",1975.104,,,,,,,,,,,,,,,,,,,,,,,,,,,,,,,,,,,,,,,,,,,,,"1970's,20th century,collage,fish,Mixed Media,Wood",http://art-collections.museum.ucsb.edu/files/original/c1d945a30e806e2d6b0121bac8362013.jpg,"Physical Object","<strong>Sculpture and Mixed Media</strong>",1,0
<strong>RITSHU</strong>,<em>Carp</em>,1912,<strong>RITSHU</strong>,,1996.35.5,,,,,,,,,,,,,,,,,,,,,,,,,,,,,,,,,,,,,,,,,,,,,"fish,Ink,Japan,portrait,Watercolor",http://art-collections.museum.ucsb.edu/files/original/bdbce831e9c7e5f34dfe699ba245fb6e.jpg,"Physical Object","<strong>The Arts of Asia</strong>",1,0
"<strong>KEARNS</strong>, Jerry","<em>Toxic Shock</em>",1988,"<strong>KEARNS</strong>, Jerry","Gift of Nicole and Douglas Walla",2003.003.001,,,,,,,,,,,,,,,,,,,,,,,,,,,,,,,,,,,,,,,,,,,,,"Black,Figurative,figures,fish,Painting,red,Yellow",http://art-collections.museum.ucsb.edu/files/original/a8569b13eb56c39b0480de21071c7cf8.jpg,"Physical Object",<strong>Paintings</strong>,1,0
"<strong>Artist unknown, Indian</strong>","<em>Cook-boy</em>, ca. early 20th C.","ca. early 20th C.","<strong>Artist unknown, Indian</strong>","Gift of John E. Carr",1963.22,,,,,,,,,,,,,,,,,,,,,,,,,,,,,,,,,,,,,,,,,,,,,"fish,folk,India,kettle,Painting,portrait,tempera",http://art-collections.museum.ucsb.edu/files/original/2b1e32c9b2fb76cb7a94430207db2a77.jpg,"Physical Object","<strong>The Arts of Asia</strong>",1,0
"<strong>Artist unknown, Chinese</strong>","<em>Genre Painting</em>, 19th C.","19th C.","<strong>Artist unknown, Chinese</strong>","Gift of Mrs. William T. Campbell",1969.258.16,,,,,,,,,,,,,,,,,,,,,,,,,,,,,,,,,,,,,,,,,,,,,"Chinese,fish,fisherman,Ink,portrait,Watercolor,Works-on-Paper,wove",http://art-collections.museum.ucsb.edu/files/original/a9b4abfa6d4c047d5e78851320a76edc.jpg,"Physical Object","<strong>The Arts of Asia</strong>",1,0
"<strong>Artist unknown, Chinese</strong>","<em>Genre Painting</em>, 19th C.","19th C.","<strong>Artist unknown, Chinese</strong>","Gift of Mrs. William T. Campbell",1969.258.17,,,,,,,,,,,,,,,,,,,,,,,,,,,,,,,,,,,,,,,,,,,,,"Chinese,fish,fisherman,Ink,portrait,Watercolor,Works-on-Paper,wove",http://art-collections.museum.ucsb.edu/files/original/5004bd7993bed2a0ba21951e1b883d0f.jpg,"Physical Object","<strong>The Arts of Asia</strong>",1,0
"<strong>RITSHU</strong>, Japanese","<em>Carp</em>, ca. 1912","ca. 1912","<strong>RITSHU,</strong> Japanese",,1996.35.5,,,,,,,,,,,,,,,,,,,,,,,,,,,,,,,,,,,,,,,,,,,,,"fish,Ink,Japan,Painting,still life,Watercolor",http://art-collections.museum.ucsb.edu/files/original/4d7ee7e6b4afee81cf0c4d2bc16406a9.jpg,"Physical Object","<strong>The Arts of Asia</strong>",1,0
"<strong>CHOSEN, Japanese</strong>","<em>Kingfisher</em>, ca. 1912","ca. 1912","<strong>CHOSEN, Japanese</strong>",,1996.35.6,,,,,,,,,,,,,,,,,,,,,,,,,,,,,,,,,,,,,,,,,,,,,"bird,fish,Ink,Japan,landscape,Painting,still life,Watercolor",http://art-collections.museum.ucsb.edu/files/original/8b20eb31ff2c3e84d8a831844c2c1f97.jpg,"Physical Object","<strong>The Arts of Asia</strong>",1,0
"<strong>KONEN, Japanese</strong>","<em>Carp and Waterplant</em>, ca. 1912","ca. 1912","<strong>KONEN, Japanese</strong>",,1996.35.7,,,,,,,,,,,,,,,,,,,,,,,,,,,,,,,,,,,,,,,,,,,,,"fish,Ink,Japan,landscape,Painting,plant,still life,Watercolor",http://art-collections.museum.ucsb.edu/files/original/6049f9e3e2c58a11d57bdaeac215a783.jpg,"Physical Object","<strong>The Arts of Asia</strong>",1,0
"<strong>South America, Peru, North Coast, Chimu</strong>","<em>Joined Double Vessel with two Figures</em>","ca. 900 - 1430 CE","<strong>South America, Peru, North Coast, Chimu</strong>","Gift of Dr. Stephen S. Goodspeed and Mrs. John Goodspeed Ainsworth",1966.13.a,,,,,,,,,,,,,,,,,,,,,,,,,,,,,,,,,,,,,,,,,,,,,"Figurative,fish,Peruvian,Pre-Columbian,Sculpture,vessel",http://art-collections.museum.ucsb.edu/files/original/5014d86fcee22aa0e313c05329154854.jpg,"Physical Object","<strong>The Arts of Ancient South America</strong>",1,0
<strong>Mexico</strong>,"Whistle Pipe",n.d.,<strong>Mexico</strong>,"Caroline Tarbell Tupper Collection of Pre-Columbian Art",1999.142,,,,,,,,,,,,,,,,,,,,,,,,,,,,,,,,,,,,,,,,,,,,,"fish,music,pipe,Pre-Columbian,Sculpture","http://art-collections.museum.ucsb.edu/files/original/6c9e16d419ae981e392b5ec6d6a20c96.jpg,http://art-collections.museum.ucsb.edu/files/original/bb1bde7d66c7d3f93061363bb40072e9.JPG","Physical Object","<strong>The Arts of Ancient Mesoamerica</strong>",1,0
