﻿"Dublin Core:Title","Dublin Core:Description","Dublin Core:Date","Dublin Core:Creator","Dublin Core:Source","Dublin Core:Identifier","Dublin Core:Contributor","Dublin Core:Rights","Dublin Core:Relation","Dublin Core:Format","Dublin Core:Language","Dublin Core:Type","Dublin Core:Coverage","Dublin Core:Subject","Dublin Core:Publisher","Item Type Metadata:Birth Date","Item Type Metadata:Birthplace","Item Type Metadata:Event Type","Item Type Metadata:Participants","Item Type Metadata:URL","Item Type Metadata:Death Date","Item Type Metadata:Occupation","Item Type Metadata:Biographical Text","Item Type Metadata:Bibliography","Item Type Metadata:File name","Item Type Metadata:Time Summary","Item Type Metadata:Interviewer","Item Type Metadata:Interviewee","Item Type Metadata:Location","Item Type Metadata:Transcription","Item Type Metadata:Local URL","Item Type Metadata:Original Format","Item Type Metadata:Physical Dimensions","Item Type Metadata:Duration","Item Type Metadata:Compression","Item Type Metadata:Producer","Item Type Metadata:Director","Item Type Metadata:Bit Rate/Frequency","Item Type Metadata:Text","Item Type Metadata:Email Body","Item Type Metadata:Subject Line","Item Type Metadata:From","Item Type Metadata:To","Item Type Metadata:CC","Item Type Metadata:BCC","Item Type Metadata:Number of Attachments","Item Type Metadata:Standards","Item Type Metadata:Objectives","Item Type Metadata:Materials","Item Type Metadata:Tags",tags,file,itemType,collection,public,featured
"<strong>ZIPERSTEIN</strong>, Bari","<em>Lives worse than a prostitute</em>",2016,"<strong>ZIPERSTEIN</strong>, Bari","Museum purchase",2017.002.001,,,,,,,,,,,,,,,,,,,,,,,,,,,,,,,,,,,,,,,,,,,,,"communism,glaze,glazed,installation,political,propaganda,Sculpture,terracotta,vase",http://art-collections.museum.ucsb.edu/files/original/ac7603499a35f5b23fdf6931289a2aca.jpg,"Physical Object","<strong>Sculpture and Mixed Media</strong>",1,0
"<strong>PICASSO</strong>, Pablo",<em>Plate</em>,1964,"<strong>PICASSO</strong>, Pablo","Gift of Mary S. and Lou Cannon",2008.003.001,,,,,,,,,,,,,,,,,,,,,,,,,,,,,,,,,,,,,,,,,,,,,"abstract,Blue,ceramic,circular,glaze,picasso,plate,Sculpture",http://art-collections.museum.ucsb.edu/files/original/5a7d5b72d2f01167f7308bb9ca04a0fe.jpg,"Physical Object","<strong>Sculpture and Mixed Media</strong>",1,0
"<strong>ISLAMIC</strong>, Iran, Seljuk","<em>Tulip Vase</em>",n.d.,"<strong>Islamic</strong>, Iran, Seljukk","Found in Collection",2015.006.001,,,,,,,,,,,,,,,,,,,,,,,,,,,,,,,,,,,,,,,,,,,,,"ceramic,glaze,Iran,Sculpture,still life,turquoise,vase",http://art-collections.museum.ucsb.edu/files/original/5c90d773cb49d83738f72a7d3ff61412.JPG,,"<strong>The Arts of the Middle East </strong>",1,0
"<strong>ISLAMIC</strong>, Iran, Safavid","<em>Bowl with floral medallion</em>","18th C.","ISLAMIC, Iran, Safavid","Found in the collection",2015.005.001,,,,,,,,,,,,,,,,,,,,,,,,,,,,,,,,,,,,,,,,,,,,,"bowl,ceramic,flower,glaze,Iran,Sculpture,still life",http://art-collections.museum.ucsb.edu/files/original/73dd95a0fac2ca5b94df217d37c3cfad.jpg,,"<strong>The Arts of the Middle East </strong>",1,0
<strong>ISLAMIC</strong>,<em>Ewer</em>,"12th - 13th C.","Iran, Nishapur, Seljuk","Grace H. Dreyfus Collection",1981.128,,,,,,,,,,,,,,,,,,,,,,,,,,,,,,,,,,,,,,,,,,,,,"ceramic,Ewer,glaze,Jug,Sculpture,still life",http://art-collections.museum.ucsb.edu/files/original/3cfbb0637fef2a520ef1cab0956f7c41.jpg,,"<strong>The Arts of the Middle East </strong>",1,0
"<strong>ISLAMIC</strong>, Iran, Isfahan, Kashan",<em>Inkwell</em>,"ca. 16th C.","Iran, Kashan","Grace H. Dreyfus Collection",1981.124,,,,,,,,,,,,,,,,,,,,,,,,,,,,,,,,,,,,,,,,,,,,,"ceramic,glaze,inkwell,Iran,Sculpture,still life,vessel",http://art-collections.museum.ucsb.edu/files/original/5a5d686db9115e1d0f44fa28b0d9d63d.jpg,,"<strong>The Arts of the Middle East </strong>",1,0
"<strong>ISLAMIC</strong>, Iran, Isfahan, Kashan",<em>Pitcher</em>,"12th - 13th C.","Iran, Kashan or Gurgan","Grace H. Dreyfus Collection",1981.122,,,,,,,,,,,,,,,,,,,,,,,,,,,,,,,,,,,,,,,,,,,,,"ceramic,glaze,Iran,pitcher,Sculpture,still life,stripes",http://art-collections.museum.ucsb.edu/files/original/27148a20b0be5e5743e9a198d2c489cf.jpg,,"<strong>The Arts of the Middle East </strong>",1,0
"<strong>ISLAMIC</strong>, Iran, Nishapur",<em>Bowl</em>,"10th - 12th C.","ISLAMIC, Iran, Nishapur","Grace H. Dreyfus Collection",1981.121,,,,,,,,,,,,,,,,,,,,,,,,,,,,,,,,,,,,,,,,,,,,,"bowl,ceramic,dish,glaze,Iran,Sculpture,still life,turquoise",http://art-collections.museum.ucsb.edu/files/original/11f72cbd8e36d037138ee6bfaa8fec03.jpg,,"<strong>The Arts of the Middle East </strong>",1,0
"<strong>ISLAMIC</strong>, Iran, Seljuk","<em>Small lusterware bowl</em>","ca. 11th - 12th C.","ISLAMIC, Iran, Saveh","Grace H. Dreyfus Collection",1981.120,,,,,,,,,,,,,,,,,,,,,,,,,,,,,,,,,,,,,,,,,,,,,"animals,bowl,ceramic,dish,glaze,Iran,iron oxide,Sculpture,still life",http://art-collections.museum.ucsb.edu/files/original/76ea358b6d5904c5ba4b35aaea9468a0.jpg,,"<strong>The Arts of the Middle East </strong>",1,0
"<strong>ISLAMIC</strong>, Iran, Amol or Sari",<em>Bowl</em>,"10th - 11th C.","ISLAMIC, Iran, Amol or Sari","Grace H. Dreyfus Collection",1981.119,,,,,,,,,,,,,,,,,,,,,,,,,,,,,,,,,,,,,,,,,,,,,"bowl,ceramic,glaze,Iran,Sculpture,still life",http://art-collections.museum.ucsb.edu/files/original/e989efaebc5ba579091d98f59f5b1d12.JPG,,"<strong>The Arts of the Middle East </strong>",1,0
"<strong>ISLAMIC</strong>, Iran",<em>Bowl</em>,n.d.,Iran,"Grace H. Dreyfus Collection",1981.118,,,,,,,,,,,,,,,,,,,,,,,,,,,,,,,,,,,,,,,,,,,,,"bowl,ceramic,geometric,glaze,Iran,Sculpture,still life",http://art-collections.museum.ucsb.edu/files/original/e06a23f60f9ac9c61320e1d71ba3c7f3.JPG,,"<strong>The Arts of the Middle East </strong>",1,0
"<strong>ISLAMIC</strong>, Iran",<em>Bowl</em>,"17th C.",Iran,"Grace H. Dreyfus Collection",1971.57,,,,,,,,,,,,,,,,,,,,,,,,,,,,,,,,,,,,,,,,,,,,,"bowl,ceramic,glaze,Iran,Sculpture,still life",http://art-collections.museum.ucsb.edu/files/original/a1fbcbdaf2b77ca9311190b7dca8c3e1.jpg,,"<strong>The Arts of the Middle East </strong>",1,0
<strong>ISLAMIC</strong>,<em>Vase</em>,"18th C.",Turkestan,,1968.87,,,,,,,,,,,,,,,,,,,,,,,,,,,,,,,,,,,,,,,,,,,,,"Blue,floral,glaze,gray,Sculpture,still life,Turkestan,vase",http://art-collections.museum.ucsb.edu/files/original/137264dec488897721423f185012c944.jpg,,"<strong>The Arts of the Middle East </strong>",1,0
"<strong>ISLAMIC</strong>, Iran, Isfahan, Kashan",<em>Jar</em>,"17th C.","Islamic, Iran, Isfahan",,1968.77,,,,,,,,,,,,,,,,,,,,,,,,,,,,,,,,,,,,,,,,,,,,,"Blue,ceramic,glaze,Iran,jar,Sculpture,still life",http://art-collections.museum.ucsb.edu/files/original/7490eef6f089438dfed53d78374c4f98.jpg,,"<strong>The Arts of the Middle East </strong>",1,0
<strong>ISLAMIC</strong>,<em>Bowl</em>,"late 16th C.",Islamic,,1968.76,,,,,,,,,,,,,,,,,,,,,,,,,,,,,,,,,,,,,,,,,,,,,"Blue,bowl,ceramic,glaze,motif,Sculpture,still life",http://art-collections.museum.ucsb.edu/files/original/b4006b03e19e3c8739d67cd2a0c71963.jpg,,"<strong>The Arts of the Middle East </strong>",1,0
"<strong>ISLAMIC</strong>, Iran, Isfahan, Kashan",<em>Vase</em>,"12th C.","ISLAMIC, Iran, Isfahan, Kashan",,1968.74.2,,,,,,,,,,,,,,,,,,,,,,,,,,,,,,,,,,,,,,,,,,,,,"ceramic,glaze,Iran,Sculpture,still life,turquoise,vase",http://art-collections.museum.ucsb.edu/files/original/d50c44cde3e69c58b267a62298cbe1b0.jpg,,"<strong>The Arts of the Middle East </strong>",1,0
"<strong>ISLAMIC</strong>, Iran, Isfahan, Kashan",<em>Vase</em>,"10th - 11th C.","ISLAMIC, Iran, isfahan, Kashan",,1968.74.1,,,,,,,,,,,,,,,,,,,,,,,,,,,,,,,,,,,,,,,,,,,,,"Blue,ceramic,glaze,Iran,Sculpture,turquoise,vase",http://art-collections.museum.ucsb.edu/files/original/1e54a27b44a4855cc45b7a033b2cd921.jpg,,"<strong>The Arts of the Middle East </strong>",1,0
"<strong>ISLAMIC</strong>, Iran, Isfahan, Kashan",<em>Pitcher</em>,"12th C.","ISLAMIC, Iran, Kashan","Gift of Mr. and Mrs. Louis G. Dreyfus",1968.73,,,,,,,,,,,,,,,,,,,,,,,,,,,,,,,,,,,,,,,,,,,,,"Blue,ceramic,glaze,Iran,pitcher,Sculpture,still life",http://art-collections.museum.ucsb.edu/files/original/bd6c1c1631c62ef1c72d8348a6e157e2.jpg,,"<strong>The Arts of the Middle East </strong>",1,0
"<strong>IKEDA</strong>, Yoshiro","<em>Kansas Landscape (Spring)</em>","ca. 1995","<strong>IKEDA</strong>, Yoshiro","UCSB 1976 MFA Graduate Student, Retired as Distinguished Professor from Kansas State University (2010)",2014.009.002,,,,,,,,,,,,,,,,,,,,,,,,,,,,,,,,,,,,,,,,,,,,,"abstract,glaze,Sculpture,still life,stoneware",http://art-collections.museum.ucsb.edu/files/original/ed458d10254db3d8fd9e479f1f6bdeed.jpg,"Physical Object","<strong>UCSB Alumni and Faculty</strong>",1,0
"<strong>IKEDA</strong>, Yoshiro","<em>Large Teapot</em>",2005,"<strong>IKEDA</strong>, Yoshiro","UCSB 1976 MFA Graduate Student, Retired as Distinguished Professor from Kansas State University (2010)",2014.009.001,,,,,,,,,,,,,,,,,,,,,,,,,,,,,,,,,,,,,,,,,,,,,"glaze,Sculpture,still life,stoneware,teapot",http://art-collections.museum.ucsb.edu/files/original/ad1e2470536a7a756547ab83a3f3c794.jpg,"Physical Object","<strong>UCSB Alumni and Faculty</strong>",1,0
"<strong>ARNTZ</strong>, Michael","<em>Mountain Pot</em>",1965-68,"<strong>ARNTZ</strong>, Michael","Gift of Tyra Byers",2012.003.001,,,,,,,,,,,,,,,,,,,,,,,,,,,,,,,,,,,,,,,,,,,,,"American,ceramic,glaze,pot,Sculpture,still life",http://art-collections.museum.ucsb.edu/files/original/76edb0c3c99bf019654d067995d48e23.jpg,"Physical Object","<strong>Outdoor Sculpture</strong>",1,0
