﻿"Dublin Core:Title","Dublin Core:Description","Dublin Core:Date","Dublin Core:Creator","Dublin Core:Source","Dublin Core:Identifier","Dublin Core:Contributor","Dublin Core:Rights","Dublin Core:Relation","Dublin Core:Format","Dublin Core:Language","Dublin Core:Type","Dublin Core:Coverage","Dublin Core:Subject","Dublin Core:Publisher","Item Type Metadata:Birth Date","Item Type Metadata:Birthplace","Item Type Metadata:Event Type","Item Type Metadata:Participants","Item Type Metadata:URL","Item Type Metadata:Death Date","Item Type Metadata:Occupation","Item Type Metadata:Biographical Text","Item Type Metadata:Bibliography","Item Type Metadata:File name","Item Type Metadata:Time Summary","Item Type Metadata:Interviewer","Item Type Metadata:Interviewee","Item Type Metadata:Location","Item Type Metadata:Transcription","Item Type Metadata:Local URL","Item Type Metadata:Original Format","Item Type Metadata:Physical Dimensions","Item Type Metadata:Duration","Item Type Metadata:Compression","Item Type Metadata:Producer","Item Type Metadata:Director","Item Type Metadata:Bit Rate/Frequency","Item Type Metadata:Text","Item Type Metadata:Email Body","Item Type Metadata:Subject Line","Item Type Metadata:From","Item Type Metadata:To","Item Type Metadata:CC","Item Type Metadata:BCC","Item Type Metadata:Number of Attachments","Item Type Metadata:Standards","Item Type Metadata:Objectives","Item Type Metadata:Materials","Item Type Metadata:Tags",tags,file,itemType,collection,public,featured
"<strong>Mexico, Maya</strong>",<em>Plate</em>,"ca. 550 - 950 CE","<strong>Mexico, Maya</strong>",,1981.1,,,,,,,,,,,,,,,,,,,,,,,,,,,,,,,,,,,,,,,,,,,,,"abstract,painted,plate,Pre-Columbian,Sculpture",http://art-collections.museum.ucsb.edu/files/original/e59b026ac496067488142f153859986e.jpg,"Physical Object","<strong>The Arts of Ancient Mesoamerica</strong>",1,0
"<strong>PICASSO</strong>, Pablo",<em>Plate</em>,1964,"<strong>PICASSO</strong>, Pablo","Gift of Mary S. and Lou Cannon",2008.003.001,,,,,,,,,,,,,,,,,,,,,,,,,,,,,,,,,,,,,,,,,,,,,"abstract,Blue,ceramic,circular,glaze,picasso,plate,Sculpture",http://art-collections.museum.ucsb.edu/files/original/5a7d5b72d2f01167f7308bb9ca04a0fe.jpg,"Physical Object","<strong>Sculpture and Mixed Media</strong>",1,0
"<strong>WOOD</strong>, Beatrice","<em>Ceramic Plate with Horse and Standing Rider</em>","20th C.","<strong>WOOD</strong>, Beatrice","Gift of Mrs. William T. Campbell",1969.23,,,,,,,,,,,,,,,,,,,,,,,,,,,,,,,,,,,,,,,,,,,,,"20th century,ceramic,Figurative,plate,Sculpture",,"Physical Object","<strong>Sculpture and Mixed Media</strong>",1,0
"<strong>WOOD</strong>, Beatrice","<em>Ceramic Plate with Nude Female on a Horse</em>","20th C","<strong>WOOD</strong>, Beatrice","Gift of Mrs. William T. Campbell",1969.231,,,,,,,,,,,,,,,,,,,,,,,,,,,,,,,,,,,,,,,,,,,,,"ceramic,Female,Figurative,iridescent,nude,plate,Sculpture",,"Physical Object","<strong>Sculpture and Mixed Media</strong>",1,0
"<strong>WOOD</strong>, Beatrice","<em>Plate with blue luster glaze</em>","20th C.","<strong>WOOD</strong>, Beatrice","Gift of Mrs. William T. Campbell",1969.232,,,,,,,,,,,,,,,,,,,,,,,,,,,,,,,,,,,,,,,,,,,,,"20th century,Blue,ceramic,luster,plate,Sculpture",,"Physical Object","<strong>Sculpture and Mixed Media</strong>",1,0
"<strong>ISLAMIC,</strong> Iran",<em>Plate</em>,"18th C.",Iran,"Grace H. Dreyfus Collection",1981.125,,,,,,,,,,,,,,,,,,,,,,,,,,,,,,,,,,,,,,,,,,,,,"ceramic,dish,Iran,plate,Sculpture,still life,turquoise",http://art-collections.museum.ucsb.edu/files/original/056d79a19a080427264ddd9f2a5003d7.jpg,,"<strong>The Arts of the Middle East </strong>",1,0
"<strong>ISLAMIC</strong>, Iran, Isfahan, Kashan",<em>Plate</em>,n.d.,"Iran, Isfahan, Kashan",,1968.92,,,,,,,,,,,,,,,,,,,,,,,,,,,,,,,,,,,,,,,,,,,,,"ceramic,Iran,plate,Sculpture,still life,turquoise",http://art-collections.museum.ucsb.edu/files/original/f64e9f6318656b8f4238bcf65f24e79e.JPG,,"<strong>The Arts of the Middle East </strong>",1,0
"<strong>ROTHROCK</strong>, Jim","<em>Flatware Place Setting</em>",1980,"Rothrock, Jim","Ruth S. Schaffner Collection",1988.35.a-e,,,,,,,,,,,,,,,,,,,,,,,,,,,,,,,,,,,,,,,,,,,,,"ceramic,Figurative,flatware,fork,Knife,mug,plate,Sculpture,spoon",http://art-collections.museum.ucsb.edu/files/original/1fa74845c7fbd10e0547fe3507822dcf.jpg,"Physical Object","<strong>The Ruth S. Schaffner Collection</strong>",1,0
