﻿"Dublin Core:Title","Dublin Core:Description","Dublin Core:Date","Dublin Core:Creator","Dublin Core:Source","Dublin Core:Identifier","Dublin Core:Contributor","Dublin Core:Rights","Dublin Core:Relation","Dublin Core:Format","Dublin Core:Language","Dublin Core:Type","Dublin Core:Coverage","Dublin Core:Subject","Dublin Core:Publisher","Item Type Metadata:Birth Date","Item Type Metadata:Birthplace","Item Type Metadata:Event Type","Item Type Metadata:Participants","Item Type Metadata:URL","Item Type Metadata:Death Date","Item Type Metadata:Occupation","Item Type Metadata:Biographical Text","Item Type Metadata:Bibliography","Item Type Metadata:File name","Item Type Metadata:Time Summary","Item Type Metadata:Interviewer","Item Type Metadata:Interviewee","Item Type Metadata:Location","Item Type Metadata:Transcription","Item Type Metadata:Local URL","Item Type Metadata:Original Format","Item Type Metadata:Physical Dimensions","Item Type Metadata:Duration","Item Type Metadata:Compression","Item Type Metadata:Producer","Item Type Metadata:Director","Item Type Metadata:Bit Rate/Frequency","Item Type Metadata:Text","Item Type Metadata:Email Body","Item Type Metadata:Subject Line","Item Type Metadata:From","Item Type Metadata:To","Item Type Metadata:CC","Item Type Metadata:BCC","Item Type Metadata:Number of Attachments","Item Type Metadata:Standards","Item Type Metadata:Objectives","Item Type Metadata:Materials","Item Type Metadata:Tags",tags,file,itemType,collection,public,featured
"<strong>ISLAMIC</strong>, Iran",<em>Beaker</em>,"12th -13th C.",,"Grace Dreyfus Collection",1981.127,,,,,,,,,,,,,,,,,,,,,,,,,,,,,,,,,,,,,,,,,,,,,"beaker,ceramic,geometric,Iran,Sculpture,still life,vessel",http://art-collections.museum.ucsb.edu/files/original/8910e39d98acbfb8bec67fe4432cccc6.jpg,,"<strong>The Arts of the Middle East </strong>",1,0
<strong>ROMAN</strong>,"<em>Gnathian Oinochoe</em>","third quarter 4th C. BCE","Southern Italian","The Arthur W. Silver Collection",1971.102,,,,,,,,,,,,,,,,,,,,,,,,,,,,,,,,,,,,,,,,,,,,,"clay,Roman,Sculpture,still life,vessel",http://art-collections.museum.ucsb.edu/files/original/7c5c6a75132cb388dfbac1f450292277.jpg,"Physical Object","<strong>The Arts of the Ancient Mediterranean</strong>",1,0
<strong>ROMAN</strong>,"<em>Glass vessel</em>","509—27 BCE",Roman,"Gift of Lynn K. Altman Family Trust",2017.007.016,,,,,,,,,,,,,,,,,,,,,,,,,,,,,,,,,,,,,,,,,,,,,"glass,Roman,Sculpture,still life,vessel",http://art-collections.museum.ucsb.edu/files/original/79a4f1408ed4d0882fc46a64cbae9fa4.jpg,"Physical Object","<strong>The Arts of the Ancient Mediterranean</strong>",1,0
<strong>ROMAN</strong>,"<em>Glass vessel</em>","509—27 BCE",Roman,"Gift of Lynn K. Altman Family Trust",2017.007.015,,,,,,,,,,,,,,,,,,,,,,,,,,,,,,,,,,,,,,,,,,,,,"glass,Roman,Sculpture,still life,vessel",http://art-collections.museum.ucsb.edu/files/original/5bad4fd5d75e1f321d00ac0994a2025a.JPG,"Physical Object","<strong>The Arts of the Ancient Mediterranean</strong>",1,0
<strong>ROMAN</strong>,"<em>Glass vessel</em>","509—27 BCE",Roman,"Gift of Lynn K. Altman Family Trust",2017.007.014,,,,,,,,,,,,,,,,,,,,,,,,,,,,,,,,,,,,,,,,,,,,,"glass,Roman,Sculpture,still life,vessel",http://art-collections.museum.ucsb.edu/files/original/2c2efc3e081cc850f850222fd6219454.jpg,"Physical Object","<strong>The Arts of the Ancient Mediterranean</strong>",1,0
<strong>ROMAN</strong>,"<em>Glass vessel</em>","509—27 BCE",ROMAN,"Gift of Lynn K. Altman Family Trust",2017.007.013,,,,,,,,,,,,,,,,,,,,,,,,,,,,,,,,,,,,,,,,,,,,,"glass,Roman,Sculpture,still life,vessel",http://art-collections.museum.ucsb.edu/files/original/32ec890f8875323852b03e51477c8765.jpg,"Physical Object","<strong>The Arts of the Ancient Mediterranean</strong>",1,0
<strong>ROMAN</strong>,"<em>Pitcher</em> (Oinochoe)",n.d.,"Italian: Pompeii?","Gift of Marsha Cooper",1997.29,,,,,,,,,,,,,,,,,,,,,,,,,,,,,,,,,,,,,,,,,,,,,"clay,Jug,pitcher,Roman,Sculpture,still life,vessel",http://art-collections.museum.ucsb.edu/files/original/93931257cca35279d343f4a6678c8779.jpg,"Physical Object","<strong>The Arts of the Ancient Mediterranean</strong>",1,0
<strong>ISLAMIC</strong>,"<em>Amlash Grey-ware Spouted Ewer</em>","ca. 1200-800 B.C.",Islamic,"Gift of Dr. and Mrs. Arnold Gordon",1981.2,,,,,,,,,,,,,,,,,,,,,,,,,,,,,,,,,,,,,,,,,,,,,"clay,gray,Islamic,Sculpture,still life,vessel",http://art-collections.museum.ucsb.edu/files/original/af82a3e6bb3f3a5abd633bc1be4aca02.jpg,,"<strong>The Arts of the Middle East </strong>",1,0
<strong>ISLAMIC</strong>,<em>Vessel</em>,n.d.,Islamic,"Grace H. Dreyfus Collection",1971.66,,,,,,,,,,,,,,,,,,,,,,,,,,,,,,,,,,,,,,,,,,,,,"Bronze,Islamic,Sculpture,still life,vessel",http://art-collections.museum.ucsb.edu/files/original/c13946f820aebc14ba6da4d4708b9e4b.jpg,,"<strong>The Arts of the Middle East </strong>",1,0
"<strong>ISLAMIC</strong>, Iran, Isfahan, Kashan",<em>Inkwell</em>,"ca. 16th C.","Iran, Kashan","Grace H. Dreyfus Collection",1981.124,,,,,,,,,,,,,,,,,,,,,,,,,,,,,,,,,,,,,,,,,,,,,"ceramic,glaze,inkwell,Iran,Sculpture,still life,vessel",http://art-collections.museum.ucsb.edu/files/original/5a5d686db9115e1d0f44fa28b0d9d63d.jpg,,"<strong>The Arts of the Middle East </strong>",1,0
<strong>GREEK</strong>,"<em>Attic Red Figured Squat Lekythos</em>","ca. 440-420 BCE",Greek,"The Arthur W. Silver Collection",1971.98,,,,,,,,,,,,,,,,,,,,,,,,,,,,,,,,,,,,,,,,,,,,,"clay,Greek,lekythos,Mythology,Sculpture,still life,vessel",http://art-collections.museum.ucsb.edu/files/original/ada92f545642548da842009972561af8.jpg,"Physical Object","<strong>The Arts of the Ancient Mediterranean</strong>",1,0
<strong>GREEK</strong>,"<em>Attic Red-Figured Lekythos</em>","ca. 445-425 BCE",Greek,"The Arthur W. Silver Collection",1971.97,,,,,,,,,,,,,,,,,,,,,,,,,,,,,,,,,,,,,,,,,,,,,"Greek,lekythos,Mythology,Sculpture,still life,vessel",http://art-collections.museum.ucsb.edu/files/original/ce90777bfbee2ed68d79d04ff9d80146.jpg,"Physical Object","<strong>The Arts of the Ancient Mediterranean</strong>",1,0
<strong>GREEK</strong>,"<em>Attic Black-Figured Lekythos</em>","ca. 510 BCE",Greek,"The Arthur W. Silver Collection",1971.96,,,,,,,,,,,,,,,,,,,,,,,,,,,,,,,,,,,,,,,,,,,,,"clay,Greek,lekythos,Sculpture,still life,vessel",http://art-collections.museum.ucsb.edu/files/original/566b86063b0aa132cd794cd61faaa6ef.jpg,"Physical Object","<strong>The Arts of the Ancient Mediterranean</strong>",1,0
<strong>GREEK</strong>,"<em>Calenian Black-Glazed Guttus</em>","ca. 3rd BCE",Greek,"The Arthur W. Silver Collection",1971.103,,,,,,,,,,,,,,,,,,,,,,,,,,,,,,,,,,,,,,,,,,,,,"clay,Greek,Sculpture,still life,vessel",http://art-collections.museum.ucsb.edu/files/original/f7ce794a543e3b2bb19eb43ec8c7abb6.jpg,"Physical Object","<strong>The Arts of the Ancient Mediterranean</strong>",1,0
<strong>GREEK</strong>,"<em>Attic White-Ground Lekythos</em>","ca. 440-400 BCE",Greek,"The Arthur W. Silver Collection",1971.100,,,,,,,,,,,,,,,,,,,,,,,,,,,,,,,,,,,,,,,,,,,,,"clay,Greek,lekythos,Sculpture,still life,vessel",http://art-collections.museum.ucsb.edu/files/original/0e76bc99d3cacd223cf172685579c1d9.jpg,"Physical Object","<strong>The Arts of the Ancient Mediterranean</strong>",1,0
"<strong>WOOD</strong>, Beatrice",<em>Vessel</em>,n.d.,"<strong>WOOD</strong>, Beatrice","Gift of Gary H. Brown",2000.1,,,,,,,,,,,,,,,,,,,,,,,,,,,,,,,,,,,,,,,,,,,,,"20th century,ceramic,clay,cylindrical,glazed,gold,luminescent,Sculpture,terracotta,vessel",http://art-collections.museum.ucsb.edu/files/original/2e64333524d0d76aa1c0959c7fbf3e6a.jpeg,"Physical Object","<strong>Sculpture and Mixed Media</strong>",1,0
"<strong>WOOD</strong>, Beatrice",<em>Vessel</em>,n.d.,"<strong>WOOD</strong>, Beatrice","Gift of Gary H. Brown",1998.1,,,,,,,,,,,,,,,,,,,,,,,,,,,,,,,,,,,,,,,,,,,,,"ceramic,clay,Sculpture,terracotta,vessel",,"Physical Object","<strong>Sculpture and Mixed Media</strong>",1,0
"<strong>West Mexico</strong>","<em>Tripod Vessel with Face</em>","ca. 600-900","<strong>West Mexico</strong>","Gift of the Children of Barbara Bullard Storke",1998.53,,,,,,,,,,,,,,,,,,,,,,,,,,,,,,,,,,,,,,,,,,,,,"portrait,Pre-Columbian,Sculpture,smiling,tripod,vessel",http://art-collections.museum.ucsb.edu/files/original/f15abc942aa666fa1bbbd98330c84353.jpg,"Physical Object","<strong>The Arts of Ancient Mesoamerica</strong>",1,0
"<strong>West Mexico, Nayarit</strong>","<em>Tripod Dome with Animal Handle</em>","ca. 300 BCE - 300 CE","<strong>West Mexico, Nayarit</strong>","Gift of Mrs. MacKinley Helm in memory of Dr. MacKinley Helm",1963.107,,,,,,,,,,,,,,,,,,,,,,,,,,,,,,,,,,,,,,,,,,,,,"animals,dome,Pre-Columbian,Sculpture,tripod,vessel",http://art-collections.museum.ucsb.edu/files/original/57942f479c6485f06990516ffe44b085.jpg,"Physical Object","<strong>The Arts of Ancient Mesoamerica</strong>",1,0
"<strong>West Mexico, Jalisco</strong>","<em>Seated Woman Figure</em>","ca. 100 BCE - 250 CE","<strong>West Mexico, Jalisco</strong>","Incoming Loan, Los Angeles County Museum of Art Gift of Constance McCormick Fearing",L2010.001.004,,,,,,,,,,,,,,,,,,,,,,,,,,,,,,,,,,,,,,,,,,,,,"Female,Figurative,Pre-Columbian,Sculpture,vessel",http://art-collections.museum.ucsb.edu/files/original/d4a81cfe88220f8a48ab06445b113fb1.jpg,"Physical Object","<strong>The Arts of Ancient Mesoamerica</strong>",1,0
"<strong>West Mexico, Colima</strong>","Wide bodied Container",n.d.,"<strong>West Mexico, Colima</strong>","Found in the Collection",2022.008.001,,,,,,,,,,,,,,,,,,,,,,,,,,,,,,,,,,,,,,,,,,,,,"bulbous,Pre-Columbian,red,Sculpture,still life,vessel",http://art-collections.museum.ucsb.edu/files/original/350bb8bbc45cfb92b94c3242676956b1.jpg,,"<strong>The Arts of Ancient Mesoamerica</strong>",1,0
"<strong>West Mexico, Colima</strong>",<em>Vessel</em>,"ca. 300 BCE- 300 CE","<strong>West Mexico, Colima</strong>",,1968.70,,,,,,,,,,,,,,,,,,,,,,,,,,,,,,,,,,,,,,,,,,,,,"dual-handled,orange,Sculpture,smooth,vessel",http://art-collections.museum.ucsb.edu/files/original/d24bb3acb5366c28590c209734531d15.jpg,"Physical Object","<strong>The Arts of Ancient Mesoamerica</strong>",1,0
"<strong>South America, Peru</strong>","<em>Stirrup vessel: monkey astride a bird</em>",n.d.,"<strong>South America, Peru</strong>","Found in the collection",2013.001.009,,,,,,,,,,,,,,,,,,,,,,,,,,,,,,,,,,,,,,,,,,,,,"animals,anthropomorphic,blackware,Peruvian,Pre-Columbian,stirrup-spout,vessel",http://art-collections.museum.ucsb.edu/files/original/65e2cf30c60c9e08bc5712a582fa6696.JPG,"Physical Object","<strong>The Arts of Ancient South America</strong>",1,0
"<strong>South America, Peru</strong>",<em>Vessel</em>,"ca. 400 BCE - 500 CE","<strong>South America, Peru</strong>","Grace H. Dreyfus Collection",1968.62,,,,,,,,,,,,,,,,,,,,,,,,,,,,,,,,,,,,,,,,,,,,,"blackware,Peruvian,portrait,Pre-Columbian,vessel,warrior",http://art-collections.museum.ucsb.edu/files/original/76034561bab710ebcc48d591f26d4264.jpg,"Physical Object","<strong>The Arts of Ancient South America</strong>",1,0
"<strong>South America, Peru, South Coast</strong>","<em>Flaring Vase</em>","550-750 C.E., Early intermediate phase","<strong>South America, Peru, South Coast</strong>","Gift of Dr. Stephen S. Goodspeed and Mrs. John Goodspeed Ainsworth",1966.15,,,,,,,,,,,,,,,,,,,,,,,,,,,,,,,,,,,,,,,,,,,,,"geometric,Peruvian,polychrome,Pre-Columbian,Sculpture,vessel",http://art-collections.museum.ucsb.edu/files/original/45fb0ee034e60c11658a7bf16d98b989.jpg,"Physical Object","<strong>The Arts of Ancient South America</strong>",1,0
"<strong>South America, Peru, South Coast, Nazca</strong>","<em>Bulbous Vase</em>","1-450 C.E.","<strong>South America, Peru, South Coast, Nazca</strong>","Gift of Dr. Stephen S. Goodspeed and Mrs. John Goodspeed Ainsworth",1966.19,,,,,,,,,,,,,,,,,,,,,,,,,,,,,,,,,,,,,,,,,,,,,"abstract,Peruvian,Pre-Columbian,Sculpture,vase,vessel",http://art-collections.museum.ucsb.edu/files/original/32665caa152865a7407fe37217da7cb6.jpg,"Physical Object","<strong>The Arts of Ancient South America</strong>",1,0
"<strong>South America, Peru, South Coast, Nazca</strong>","<em>Cup Bowl</em>","550-750 C.E.","<strong>South America, Peru, South Coast, Nazca</strong>","Gift of Dr. Stephen S. Goodspeed and Mrs. John Goodspeed Ainsworth",1966.28,,,,,,,,,,,,,,,,,,,,,,,,,,,,,,,,,,,,,,,,,,,,,"abstract,orange,Peruvian,Pre-Columbian,Sculpture,vessel",http://art-collections.museum.ucsb.edu/files/original/158d5f14bbd0a49ffe61f9b8a431d83c.jpg,"Physical Object","<strong>The Arts of Ancient South America</strong>",1,0
"<strong>South America, Peru, South Coast, Nazca</strong>","<em>Kero vessel</em>","550-750 C.E.","<strong>South America, Peru, South Coast, Nazca</strong>","Grace H. Dreyfus Collection",1968.65,,,,,,,,,,,,,,,,,,,,,,,,,,,,,,,,,,,,,,,,,,,,,"abstract,Peruvian,polychrome,Pre-Columbian,Sculpture,vessel",http://art-collections.museum.ucsb.edu/files/original/cc6ca3f1b4ab2d0136061e17948b3a44.jpg,"Physical Object","<strong>The Arts of Ancient South America</strong>",1,0
"<strong>South America, Peru, South Coast, Nazca</strong>","<em>Round Bottom Bowl</em>","1-450 C.E.","<strong>South America, Peru, South Coast, Nazca</strong>","Gift of Dr. Stephen S. Goodspeed and Mrs. John Goodspeed Ainsworth",1966.29,,,,,,,,,,,,,,,,,,,,,,,,,,,,,,,,,,,,,,,,,,,,,"peppers,Peruvian,polychrome,Pre-Columbian,Sculpture,vessel",http://art-collections.museum.ucsb.edu/files/original/2c0fa9a8e924591e1d21b2bd702cdd80.jpg,"Physical Object","<strong>The Arts of Ancient South America</strong>",1,0
"<strong>South America, Peru, South Coast, Nazca</strong>","<em>Cup bowl</em>","1-450 C.E.","<strong>South America, Peru, South Coast, Nazca</strong>","Gift of Dr. Stephen S. Goodspeed and Mrs. John Goodspeed Ainsworth",1966.25,,,,,,,,,,,,,,,,,,,,,,,,,,,,,,,,,,,,,,,,,,,,,"abstract,Peruvian,polychrome,Sculpture,vessel",http://art-collections.museum.ucsb.edu/files/original/619481f1e55580772b051a3b6eabf397.jpg,"Physical Object","<strong>The Arts of Ancient South America</strong>",1,0
"<strong>South America, Peru, South Coast, Nazca</strong>","<em>Flaring Goblet</em>","450-550 C.E.","<strong>South America, Peru, South Coast, Nazca</strong>","Gift of Dr. Stephen S. Goodspeed and Mrs. John Goodspeed Ainsworth",1966.26,,,,,,,,,,,,,,,,,,,,,,,,,,,,,,,,,,,,,,,,,,,,,"Mythology,Peruvian,polychrome,Pre-Columbian,Sculpture,vessel",http://art-collections.museum.ucsb.edu/files/original/895af7318465eb7d0669ce319ce3e02a.jpg,"Physical Object","<strong>The Arts of Ancient South America</strong>",1,0
"<strong>South America, Peru, South Coast, Nazca</strong>","<em>Polychrome Strap Handled Vessel</em>",n.d.,"<strong>South America, Peru, South Coast, Nazca</strong>","Gift of Dr. Stephen S. Ainsworth and Mrs. John Goodspeed Ainsworth",1966.68,,,,,,,,,,,,,,,,,,,,,,,,,,,,,,,,,,,,,,,,,,,,,"animals,Peruvian,polychrome,Pre-Columbian,Sculpture,vessel",http://art-collections.museum.ucsb.edu/files/original/f8f7b67f22434f1afa9bec081242ec3f.jpg,"Physical Object","<strong>The Arts of Ancient South America</strong>",1,0
"<strong>South America, Peru, South Coast, Nazca</strong>","<em>Tripod Vessel</em>","ca. 200 - 500 CE","<strong>South America, Peru, South Coast, Nazca</strong>","Gift of Dr. Stephen S. Ainsworth and Mrs. John Goodspeed Ainsworth",1966.33,,,,,,,,,,,,,,,,,,,,,,,,,,,,,,,,,,,,,,,,,,,,,"abstract,Peruvian,polychrome,Pre-Columbian,Sculpture,vessel",http://art-collections.museum.ucsb.edu/files/original/7f2639727c2a7ae9cf7e5df0c889ca96.jpg,"Physical Object","<strong>The Arts of Ancient South America</strong>",1,0
"<strong>South America, Peru, South Coast, Nazca</strong>",<em>Bowl</em>,"1-450 C.E.","<strong>South America, Peru, South Coast, Nazca</strong>","Gift of Dr. Stephen S. Goodspeed and Mrs. John Goodspeed Ainsworth",1966.30,,,,,,,,,,,,,,,,,,,,,,,,,,,,,,,,,,,,,,,,,,,,,"peppers,Peruvian,polychrome,Pre-Columbian,Sculpture,vessel",http://art-collections.museum.ucsb.edu/files/original/7090e9abd63dd9940ccfeb99fcb01997.jpg,"Physical Object","<strong>The Arts of Ancient South America</strong>",1,0
"<strong>South America, Peru, South Coast, Nazca</strong>","<em>Cup Bowl`</em>","1-450 C.E.","<strong>South America, Peru, South Coast, Nazca</strong>","Gift of Dr. Stephen S. Goodspeed and Mrs. John Goodspeed Ainsworth",1966.20,,,,,,,,,,,,,,,,,,,,,,,,,,,,,,,,,,,,,,,,,,,,,"abstract,Peruvian,polychrome,Pre-Columbian,Sculpture,vessel",http://art-collections.museum.ucsb.edu/files/original/49a52d5012c9342b016db86a6df51d38.jpg,"Physical Object","<strong>The Arts of Ancient South America</strong>",1,0
"<strong>South America, Peru, South Coast, Nazca</strong>","<em>Double spout and bridge vessel</em>","200 BCE- CE 600","<strong>South America, Peru, South Coast, Nazca</strong>","Gift of Antoinette Amorteguy",1994.3,,,,,,,,,,,,,,,,,,,,,,,,,,,,,,,,,,,,,,,,,,,,,"Mythology,Peruvian,polychrome,Pre-Columbian,Sculpture,vessel",http://art-collections.museum.ucsb.edu/files/original/01ef5e33bb7f03f4af2e46dfd5434e0a.jpg,"Physical Object","<strong>The Arts of Ancient South America</strong>",1,0
"<strong>South America, Peru, South Coast, Nazca</strong>","<em>Modeled double spot Lucuma</em>","1-450 C.E.","<strong>South America, Peru, South Coast, Nazca</strong>","Gift of Dr. Stephen S. Goodspeed and Mrs. John Goodspeed Ainsworth",1966.23,,,,,,,,,,,,,,,,,,,,,,,,,,,,,,,,,,,,,,,,,,,,,"Peruvian,polychrome,Pre-Columbian,red,Sculpture,vessel",http://art-collections.museum.ucsb.edu/files/original/de1e3b398653ee5757428985bd921a81.jpg,"Physical Object","<strong>The Arts of Ancient South America</strong>",1,0
"<strong>South America, Peru, North Coast, Moche</strong>","<em>Stirrup spout effigy vessel</em>",n.d.,"<strong>South America, Peru, North Coast, Moche</strong>","Gift of Dr. Stephen S. Goodspeed and Mrs. John Goodspeed Ainsworth",1966.16,,,,,,,,,,,,,,,,,,,,,,,,,,,,,,,,,,,,,,,,,,,,,"corn,Figurative,Peruvian,Pre-Columbian,Sculpture,vessel",http://art-collections.museum.ucsb.edu/files/original/8d25beae63ee29d17f550a436d921881.jpg,"Physical Object","<strong>The Arts of Ancient South America</strong>",1,0
"<strong>South America, Peru, North Coast, Moche</strong>","<em>stirruup spout vessel</em>",n.d.,"<strong>South America, Peru, North Coast, Moche</strong>","Gift of Dr. Stephen S. Goodspeed and Mrs. John Goodspeed Ainsworth",1966.14,,,,,,,,,,,,,,,,,,,,,,,,,,,,,,,,,,,,,,,,,,,,,"Peruvian,polychrome,Pre-Columbian,red,Sculpture,stirrup-spout,vessel",http://art-collections.museum.ucsb.edu/files/original/65c55a21fec8c04c036ce3e766277826.jpg,"Physical Object","<strong>The Arts of Ancient South America</strong>",1,0
"<strong>South America, Peru, North Coast, Inca, Chimu</strong>",<em>Bottle</em>,"ca. 900 - 1450 AD","<strong>South America, Peru, North Coast, Inca, Chimu</strong>",,1968.68,,,,,,,,,,,,,,,,,,,,,,,,,,,,,,,,,,,,,,,,,,,,,"geometric,orange,Peruvian,Pre-Columbian,Sculpture,vessel",http://art-collections.museum.ucsb.edu/files/original/61b9fc4bf50089e02259bef72089e672.jpg,"Physical Object","<strong>The Arts of Ancient South America</strong>",1,0
"<strong>South America, Peru, North Coast, Chimu</strong>","<em>Vessel, Huaca Sculptured Bottle</em>","ca. 900 - 1450 CE","<strong>South America, Peru, North Coast, Chimu</strong>","Grace H. Dreyfus Collection",1971.59,,,,,,,,,,,,,,,,,,,,,,,,,,,,,,,,,,,,,,,,,,,,,"animals,blackware,Peruvian,Pre-Columbian,Sculpture,vessel",http://art-collections.museum.ucsb.edu/files/original/ec731d530dfc5c90d2be2c17dd666661.jpg,"Physical Object","<strong>The Arts of Ancient South America</strong>",1,0
"<strong>South America, Peru, North Coast, Chimu</strong>","<em>Chimu Ceramic Vessel</em>","ca. 15th C.","<strong>South America, Peru, North Coast, Chimu</strong>","Grace H. Dreyfus Collection",1968.61,,,,,,,,,,,,,,,,,,,,,,,,,,,,,,,,,,,,,,,,,,,,,"dual-handled,Peruvian,Pre-Columbian,Sculpture,utility,vessel","http://art-collections.museum.ucsb.edu/files/original/c400fb35c4070a6bf2bf3e6eb6441943.jpg,http://art-collections.museum.ucsb.edu/files/original/222610ed84f8f7af1c6aecfa0ffa6071.jpg","Physical Object","<strong>The Arts of Ancient South America</strong>",1,0
"<strong>South America, Peru, North Coast, Chimu</strong>",<em>Kero</em>,"ca. 900 - 1430 CE","<strong>South America, Peru, North Coast, Chimu</strong>","Grace H. Dreyfus Collection",1968.6,,,,,,,,,,,,,,,,,,,,,,,,,,,,,,,,,,,,,,,,,,,,,"blackware,Peruvian,portrait,Pre-Columbian,Sculpture,vessel",http://art-collections.museum.ucsb.edu/files/original/e81c11ab6232c9b3ff582a278cc265be.jpg,"Physical Object","<strong>The Arts of Ancient South America</strong>",1,0
"<strong>South America, Peru, North Coast, Chimu</strong>",<em>Vessel</em>,"ca. 900 - 1430 CE","<strong>South America, Peru, North Coast, Chimu</strong>","Grace H. Dreyfus Collection",1968.59,,,,,,,,,,,,,,,,,,,,,,,,,,,,,,,,,,,,,,,,,,,,,"Peruvian,physical object,Pre-Columbian,Sculpture,vessel,weathered","http://art-collections.museum.ucsb.edu/files/original/b1076facd138d3a2bb5379d3ab30ab47.jpg,http://art-collections.museum.ucsb.edu/files/original/a8dfa9f4c08f69c97a1cd83362dd81f5.jpg","Physical Object","<strong>The Arts of Ancient South America</strong>",1,0
"<strong>South America, Peru, North Coast, Chimu</strong>","<em>stirrup pot</em>","ca. 900 - 1430 CE","<strong>South America, Peru, North Coast, Chimu</strong>","Grace H. Dreyfus Collection",1968.57,,,,,,,,,,,,,,,,,,,,,,,,,,,,,,,,,,,,,,,,,,,,,"blackware,Peruvian,Sculpture,stirrup-spout,vessel",http://art-collections.museum.ucsb.edu/files/original/6fbf9c899f512838812d3ab23d5f8f7b.jpg,"Physical Object","<strong>The Arts of Ancient South America</strong>",1,0
"<strong>South America, Peru, North Coast, Chimu</strong>","<em>Coiled Stirrup Pot</em>","ca. 900 - 1430 CE","<strong>South America, Peru, North Coast, Chimu</strong>","Grace H. Dreyfus Collection",1968.56,,,,,,,,,,,,,,,,,,,,,,,,,,,,,,,,,,,,,,,,,,,,,"blackware,coiled,Peruvian,Pre-Columbian,Sculpture,stirrup-spout,vessel",http://art-collections.museum.ucsb.edu/files/original/331224478f237ffd8c4608e5dfce678b.jpg,"Physical Object","<strong>The Arts of Ancient South America</strong>",1,0
"<strong>South America, Peru, North Coast, Chimu</strong>","<em>ceramic vessel</em>","ca. 900 - 1430 CE","<strong>South America, Peru, North Coast, Chimu</strong>","Grace H. Dreyfus Collection",1968.53,,,,,,,,,,,,,,,,,,,,,,,,,,,,,,,,,,,,,,,,,,,,,"blackware,Figurative,Peruvian,Pre-Columbian,Sculpture,vessel",http://art-collections.museum.ucsb.edu/files/original/a98f50a723864d9678c081c6b9e07a82.jpg,"Physical Object","<strong>The Arts of Ancient South America</strong>",1,0
"<strong>South America, Peru, North Coast, Chimu</strong>","<em>Stirrup spout vessel</em>","ca. 900 - 1430 CE","<strong>South America, Peru, North Coast, Chimu</strong>","Gift of Dr. Stephen S. Goodspeed and Mrs. John Goodspeed Ainsworth",1966.12,,,,,,,,,,,,,,,,,,,,,,,,,,,,,,,,,,,,,,,,,,,,,"blackware,Peruvian,Pre-Columbian,Sculpture,stirrup-spout,vessel",http://art-collections.museum.ucsb.edu/files/original/67930d92496235eba0ad7322fb28f1ee.jpg,"Physical Object","<strong>The Arts of Ancient South America</strong>",1,0
"<strong>South America, Peru, North Coast, Chimu</strong>",<em>Vessel</em>,"ca. 900 - 1430","<strong>South America, Peru, North Coast, Chimu</strong>","Grace H. Dreyfus Collection",1968.52,,,,,,,,,,,,,,,,,,,,,,,,,,,,,,,,,,,,,,,,,,,,,"blackware,Figurative,Peruvian,Pre-Columbian,Sculpture,vessel",http://art-collections.museum.ucsb.edu/files/original/fda6e8f40a386d0130f69925b31d772d.jpg,"Physical Object","<strong>The Arts of Ancient South America</strong>",1,0
"<strong>South America, Peru, North Coast, Chimu</strong>","<em>Bottle with Handle</em>","ca. 900 - 1430 CE","<strong>South America, Peru, North Coast, Chimu</strong>","Gift of Dr. Stephen S. Goodspeed and Mrs. John Goodspeed Ainsworth",1966.63,,,,,,,,,,,,,,,,,,,,,,,,,,,,,,,,,,,,,,,,,,,,,"blackware,broken,Peruvian,Pre-Columbian,Sculpture,vessel",http://art-collections.museum.ucsb.edu/files/original/edee1c20ecaeeb731d3ac0c378d97d51.jpg,"Physical Object","<strong>The Arts of Ancient South America</strong>",1,0