﻿"Dublin Core:Title","Dublin Core:Description","Dublin Core:Date","Dublin Core:Creator","Dublin Core:Source","Dublin Core:Identifier","Dublin Core:Contributor","Dublin Core:Rights","Dublin Core:Relation","Dublin Core:Format","Dublin Core:Language","Dublin Core:Type","Dublin Core:Coverage","Dublin Core:Subject","Dublin Core:Publisher","Item Type Metadata:Birth Date","Item Type Metadata:Birthplace","Item Type Metadata:Event Type","Item Type Metadata:Participants","Item Type Metadata:URL","Item Type Metadata:Death Date","Item Type Metadata:Occupation","Item Type Metadata:Biographical Text","Item Type Metadata:Bibliography","Item Type Metadata:File name","Item Type Metadata:Time Summary","Item Type Metadata:Interviewer","Item Type Metadata:Interviewee","Item Type Metadata:Location","Item Type Metadata:Transcription","Item Type Metadata:Local URL","Item Type Metadata:Original Format","Item Type Metadata:Physical Dimensions","Item Type Metadata:Duration","Item Type Metadata:Compression","Item Type Metadata:Producer","Item Type Metadata:Director","Item Type Metadata:Bit Rate/Frequency","Item Type Metadata:Text","Item Type Metadata:Email Body","Item Type Metadata:Subject Line","Item Type Metadata:From","Item Type Metadata:To","Item Type Metadata:CC","Item Type Metadata:BCC","Item Type Metadata:Number of Attachments","Item Type Metadata:Standards","Item Type Metadata:Objectives","Item Type Metadata:Materials","Item Type Metadata:Tags",tags,file,itemType,collection,public,featured
"<strong>MCDONALD</strong>, Ian","<em>Banded Vessel</em>",2012,"<strong>MCDONALD</strong>, Ian","Gift of Ian McDonald",2014.014.001,,,,,,,,,,,,,,,,,,,,,,,,,,,,,,,,,,,,,,,,,,,,,"ceramic,glazed,Sculpture,still life,vessel",http://art-collections.museum.ucsb.edu/files/original/a282286646f112e5687e60573213654c.jpg,"Physical Object","<strong>UCSB Alumni and Faculty</strong>",1,0
<strong>ISLAMIC</strong>,<em>Vessel</em>,n.d.,Islamic,"Grace H. Dreyfus Collection",1971.66,,,,,,,,,,,,,,,,,,,,,,,,,,,,,,,,,,,,,,,,,,,,,"Bronze,Islamic,Sculpture,still life,vessel",http://art-collections.museum.ucsb.edu/files/original/c13946f820aebc14ba6da4d4708b9e4b.jpg,,"<strong>The Arts of the Middle East </strong>",1,0
<strong>ISLAMIC</strong>,"<em>Amlash Grey-ware Spouted Ewer</em>","ca. 1200-800 B.C.",Islamic,"Gift of Dr. and Mrs. Arnold Gordon",1981.2,,,,,,,,,,,,,,,,,,,,,,,,,,,,,,,,,,,,,,,,,,,,,"clay,gray,Islamic,Sculpture,still life,vessel",http://art-collections.museum.ucsb.edu/files/original/af82a3e6bb3f3a5abd633bc1be4aca02.jpg,,"<strong>The Arts of the Middle East </strong>",1,0
"<strong>ISLAMIC</strong>, Iran, Isfahan, Kashan",<em>Inkwell</em>,"ca. 16th C.","Iran, Kashan","Grace H. Dreyfus Collection",1981.124,,,,,,,,,,,,,,,,,,,,,,,,,,,,,,,,,,,,,,,,,,,,,"ceramic,glaze,inkwell,Iran,Sculpture,still life,vessel",http://art-collections.museum.ucsb.edu/files/original/5a5d686db9115e1d0f44fa28b0d9d63d.jpg,,"<strong>The Arts of the Middle East </strong>",1,0
"<strong>ISLAMIC</strong>, Iran",<em>Beaker</em>,"12th -13th C.",,"Grace Dreyfus Collection",1981.127,,,,,,,,,,,,,,,,,,,,,,,,,,,,,,,,,,,,,,,,,,,,,"beaker,ceramic,geometric,Iran,Sculpture,still life,vessel",http://art-collections.museum.ucsb.edu/files/original/8910e39d98acbfb8bec67fe4432cccc6.jpg,,"<strong>The Arts of the Middle East </strong>",1,0
<strong>ROMAN</strong>,"<em>Gnathian Oinochoe</em>","third quarter 4th C. BCE","Southern Italian","The Arthur W. Silver Collection",1971.102,,,,,,,,,,,,,,,,,,,,,,,,,,,,,,,,,,,,,,,,,,,,,"clay,Roman,Sculpture,still life,vessel",http://art-collections.museum.ucsb.edu/files/original/7c5c6a75132cb388dfbac1f450292277.jpg,"Physical Object","<strong>The Arts of the Ancient Mediterranean</strong>",1,0
<strong>ROMAN</strong>,"<em>Pitcher</em> (Oinochoe)",n.d.,"Italian: Pompeii?","Gift of Marsha Cooper",1997.29,,,,,,,,,,,,,,,,,,,,,,,,,,,,,,,,,,,,,,,,,,,,,"clay,Jug,pitcher,Roman,Sculpture,still life,vessel",http://art-collections.museum.ucsb.edu/files/original/93931257cca35279d343f4a6678c8779.jpg,"Physical Object","<strong>The Arts of the Ancient Mediterranean</strong>",1,0
<strong>ROMAN</strong>,"<em>Glass vessel</em>","509—27 BCE",ROMAN,"Gift of Lynn K. Altman Family Trust",2017.007.013,,,,,,,,,,,,,,,,,,,,,,,,,,,,,,,,,,,,,,,,,,,,,"glass,Roman,Sculpture,still life,vessel",http://art-collections.museum.ucsb.edu/files/original/32ec890f8875323852b03e51477c8765.jpg,"Physical Object","<strong>The Arts of the Ancient Mediterranean</strong>",1,0
<strong>ROMAN</strong>,"<em>Glass vessel</em>","509—27 BCE",Roman,"Gift of Lynn K. Altman Family Trust",2017.007.014,,,,,,,,,,,,,,,,,,,,,,,,,,,,,,,,,,,,,,,,,,,,,"glass,Roman,Sculpture,still life,vessel",http://art-collections.museum.ucsb.edu/files/original/2c2efc3e081cc850f850222fd6219454.jpg,"Physical Object","<strong>The Arts of the Ancient Mediterranean</strong>",1,0
<strong>ROMAN</strong>,"<em>Glass vessel</em>","509—27 BCE",Roman,"Gift of Lynn K. Altman Family Trust",2017.007.015,,,,,,,,,,,,,,,,,,,,,,,,,,,,,,,,,,,,,,,,,,,,,"glass,Roman,Sculpture,still life,vessel",http://art-collections.museum.ucsb.edu/files/original/5bad4fd5d75e1f321d00ac0994a2025a.JPG,"Physical Object","<strong>The Arts of the Ancient Mediterranean</strong>",1,0
<strong>ROMAN</strong>,"<em>Glass vessel</em>","509—27 BCE",Roman,"Gift of Lynn K. Altman Family Trust",2017.007.016,,,,,,,,,,,,,,,,,,,,,,,,,,,,,,,,,,,,,,,,,,,,,"glass,Roman,Sculpture,still life,vessel",http://art-collections.museum.ucsb.edu/files/original/79a4f1408ed4d0882fc46a64cbae9fa4.jpg,"Physical Object","<strong>The Arts of the Ancient Mediterranean</strong>",1,0
<strong>GREEK</strong>,"<em>Attic White-Ground Lekythos</em>","ca. 440-400 BCE",Greek,"The Arthur W. Silver Collection",1971.100,,,,,,,,,,,,,,,,,,,,,,,,,,,,,,,,,,,,,,,,,,,,,"clay,Greek,lekythos,Sculpture,still life,vessel",http://art-collections.museum.ucsb.edu/files/original/0e76bc99d3cacd223cf172685579c1d9.jpg,"Physical Object","<strong>The Arts of the Ancient Mediterranean</strong>",1,0
<strong>GREEK</strong>,"<em>Calenian Black-Glazed Guttus</em>","ca. 3rd BCE",Greek,"The Arthur W. Silver Collection",1971.103,,,,,,,,,,,,,,,,,,,,,,,,,,,,,,,,,,,,,,,,,,,,,"clay,Greek,Sculpture,still life,vessel",http://art-collections.museum.ucsb.edu/files/original/f7ce794a543e3b2bb19eb43ec8c7abb6.jpg,"Physical Object","<strong>The Arts of the Ancient Mediterranean</strong>",1,0
<strong>GREEK</strong>,"<em>Attic Black-Figured Lekythos</em>","ca. 510 BCE",Greek,"The Arthur W. Silver Collection",1971.96,,,,,,,,,,,,,,,,,,,,,,,,,,,,,,,,,,,,,,,,,,,,,"clay,Greek,lekythos,Sculpture,still life,vessel",http://art-collections.museum.ucsb.edu/files/original/566b86063b0aa132cd794cd61faaa6ef.jpg,"Physical Object","<strong>The Arts of the Ancient Mediterranean</strong>",1,0
<strong>GREEK</strong>,"<em>Attic Red-Figured Lekythos</em>","ca. 445-425 BCE",Greek,"The Arthur W. Silver Collection",1971.97,,,,,,,,,,,,,,,,,,,,,,,,,,,,,,,,,,,,,,,,,,,,,"Greek,lekythos,Mythology,Sculpture,still life,vessel",http://art-collections.museum.ucsb.edu/files/original/ce90777bfbee2ed68d79d04ff9d80146.jpg,"Physical Object","<strong>The Arts of the Ancient Mediterranean</strong>",1,0
<strong>GREEK</strong>,"<em>Attic Red Figured Squat Lekythos</em>","ca. 440-420 BCE",Greek,"The Arthur W. Silver Collection",1971.98,,,,,,,,,,,,,,,,,,,,,,,,,,,,,,,,,,,,,,,,,,,,,"clay,Greek,lekythos,Mythology,Sculpture,still life,vessel",http://art-collections.museum.ucsb.edu/files/original/ada92f545642548da842009972561af8.jpg,"Physical Object","<strong>The Arts of the Ancient Mediterranean</strong>",1,0
"<strong>Maker unknown, New Mexico, Laguna Pueblo</strong>",<em>Vessel</em>,"20th C.","<strong>Maker unknown, New Mexico, Laguna Pueblo</strong>","Gift of Mrs. William T. Campbell",1969.250.g,,,,,,,,,,,,,,,,,,,,,,,,,,,,,,,,,,,,,,,,,,,,,"20th century,animals,ceramic,Sculpture,still life,vessel",http://art-collections.museum.ucsb.edu/files/original/315551b0be0aa76b7958e0370a1f9be3.jpg,"Physical Object","<p><strong>The Arts of Indigenous North America</strong></p>",1,0
"<strong>Maker unknown, New Mexico, Laguna Pueblo</strong>",<em>Vessel</em>,"20th C.","<strong>Maker unknown, New Mexico, Laguna Pueblo</strong>","Gift of Mrs. William T. Campbell",1969.250.h,,,,,,,,,,,,,,,,,,,,,,,,,,,,,,,,,,,,,,,,,,,,,"20th century,ceramic,Native American,Sculpture,still life,vessel",http://art-collections.museum.ucsb.edu/files/original/cf00e1fc08eb55344c5e543c40db080c.jpg,"Physical Object","<p><strong>The Arts of Indigenous North America</strong></p>",1,0
"<strong>WOOD</strong>, Beatrice",<em>Vessel</em>,n.d.,"<strong>WOOD</strong>, Beatrice","Gift of Gary H. Brown",1998.1,,,,,,,,,,,,,,,,,,,,,,,,,,,,,,,,,,,,,,,,,,,,,"ceramic,clay,Sculpture,terracotta,vessel",,"Physical Object","<strong>Sculpture and Mixed Media</strong>",1,0
"<strong>WOOD</strong>, Beatrice",<em>Vessel</em>,n.d.,"<strong>WOOD</strong>, Beatrice","Gift of Gary H. Brown",2000.1,,,,,,,,,,,,,,,,,,,,,,,,,,,,,,,,,,,,,,,,,,,,,"20th century,ceramic,clay,cylindrical,glazed,gold,luminescent,Sculpture,terracotta,vessel",http://art-collections.museum.ucsb.edu/files/original/2e64333524d0d76aa1c0959c7fbf3e6a.jpeg,"Physical Object","<strong>Sculpture and Mixed Media</strong>",1,0
"<strong>ODUNDO</strong>, Magdalene","<em>Untitled #6</em>",1995,"<strong>ODUNDO</strong>, Magdalene","Gift of Barry A. Kitnick and Jill Alexander Kitnick, Anthony Slayter-Ralph and the artist",2000.71,,,,,,,,,,,,,,,,,,,,,,,,,,,,,,,,,,,,,,,,,,,,,"African,anthropomorphic,ceramic,gourd,kenyan,orange,Sculpture,vessel",http://art-collections.museum.ucsb.edu/files/original/bac19b10b9170e496caba92aa02ac8f2.jpg,"Physical Object","<strong>Sculpture and Mixed Media</strong>",1,0
"<strong>MANSHIP</strong>, Paul",<em>Urn</em>,1919,"<strong>MANSHIP</strong>, Paul","Gift of Eric Gugler",1969.3.a-b,,,,,,,,,,,,,,,,,,,,,,,,,,,,,,,,,,,,,,,,,,,,,"20th century,alabaster,memorial,Sculpture,stone,urn,vessel",http://art-collections.museum.ucsb.edu/files/original/ef634c7c6824f39a1161588de6b76ccf.jpg,"Physical Object","<strong>Sculpture and Mixed Media</strong>",1,0
"<strong>Asante, Ghana</strong>","<em>Ritual Vessel</em>","20th C.","<strong>Asante, Ghana</strong>","UCSB Art Affiliates Purchase Fund",1973.59,,,,,,,,,,,,,,,,,,,,,,,,,,,,,,,,,,,,,,,,,,,,,"20th century,Sculpture,still life,terracotta,vessel","http://art-collections.museum.ucsb.edu/files/original/2edfd2749d37b14f3cfdce6493b14734.jpg,http://art-collections.museum.ucsb.edu/files/original/06c38b57964aa7d62be761ac5c8b6d11.jpg","Physical Object","<strong>The Arts of Africa</strong>",1,0
"<strong>Maker Unknown, African</strong>","<em>Milk container</em>",n.d.,"<strong>Maker Unknown, African</strong>","Gift of Mr. and Mrs. Jospeh R. Ciaramella",1982.34,,,,,,,,,,,,,,,,,,,,,,,,,,,,,,,,,,,,,,,,,,,,,"Beads,container,gourd,Leather,metal,Sculpture,still life,vessel",http://art-collections.museum.ucsb.edu/files/original/2b6c30642618aa417886cc684fb8d4cd.jpg,"Physical Object","<strong>The Arts of Africa</strong>",1,0
"<strong>South America, Peru, Central Coast, Chancay </strong>",<em>Vessel</em>,"ca. 900 - 1300","<strong>South America, Peru, Central Coast, Chancay </strong>","Grace H. Dreyfus Collection",1968.50,,,,,,,,,,,,,,,,,,,,,,,,,,,,,,,,,,,,,,,,,,,,,"dual-handled,geometric,Peruvian,Pre-Columbian,Sculpture,vessel",http://art-collections.museum.ucsb.edu/files/original/3a57f5cd32013c85db3cc8093747bb5e.jpg,"Physical Object","<strong>The Arts of Ancient South America</strong>",1,0
"<strong>South America, Peru, Central Coast, Chancay </strong>","<em>Chancay Pottery Vessel</em>","ca. 1250 - 1450","<strong>South America, Peru, Central Coast, Chancay </strong>",,1981.42,,,,,,,,,,,,,,,,,,,,,,,,,,,,,,,,,,,,,,,,,,,,,"Female,Figurative,Peruvian,Pre-Columbian,Sculpture,vessel",http://art-collections.museum.ucsb.edu/files/original/81d47f210bd76b1e733e6b6db79904ee.jpg,"Physical Object","<strong>The Arts of Ancient South America</strong>",1,0
"<strong>South America, Peru, North Coast, Chimu ""Style""</strong>",<em>Vessel</em>,"ca. 16th C. Early Colonial","<strong>South America, Peru, North Coast, Chimu ""Style""</strong>","Gift of Mr. and Mrs. Louis G. Dreyfus",1968.93,,,,,,,,,,,,,,,,,,,,,,,,,,,,,,,,,,,,,,,,,,,,,"colonial,Peruvian,portrait,Pre-Columbian,Sculpture,vessel",http://art-collections.museum.ucsb.edu/files/original/d66509db8540157f2de967274d0f6aeb.jpg,"Physical Object","<strong>The Arts of Ancient South America</strong>",1,0
"<strong>South America, Peru, North Coast, Chimu</strong>","<em>Joined Double Vessel with two Figures</em>","ca. 900 - 1430 CE","<strong>South America, Peru, North Coast, Chimu</strong>","Gift of Dr. Stephen S. Goodspeed and Mrs. John Goodspeed Ainsworth",1966.13.a,,,,,,,,,,,,,,,,,,,,,,,,,,,,,,,,,,,,,,,,,,,,,"Figurative,fish,Peruvian,Pre-Columbian,Sculpture,vessel",http://art-collections.museum.ucsb.edu/files/original/5014d86fcee22aa0e313c05329154854.jpg,"Physical Object","<strong>The Arts of Ancient South America</strong>",1,0
"<strong>South America, Peru, North Coast, Chimu</strong>","<em>Black Ware Vessel</em>","ca. 900 - 1430 CE","<strong>South America, Peru, North Coast, Chimu</strong>","Gift of Dr. Stephen S. Gooodspeed and Mrs. John Goodspeed Ainsworth",1966.22,,,,,,,,,,,,,,,,,,,,,,,,,,,,,,,,,,,,,,,,,,,,,"animals,blackware,Peruvian,Pre-Columbian,Sculpture,vessel",http://art-collections.museum.ucsb.edu/files/original/88c88b785fb73de040ab98bcbd31eedd.jpg,"Physical Object","<strong>The Arts of Ancient South America</strong>",1,0
"<strong>South America, Peru, North Coast, Chimu</strong>","<em>Double Body Vessel with Fish Image</em>","ca. 900 - 1430 CE","<strong>South America, Peru, North Coast, Chimu</strong>","Gift of Dr. Stephen S. Goodspeed and Mrs. John Goodspeed Ainsworth",1966.37.1,,,,,,,,,,,,,,,,,,,,,,,,,,,,,,,,,,,,,,,,,,,,,"blackware,Figurative,Mythology,Peruvian,Pre-Columbian,Sculpture,vessel",http://art-collections.museum.ucsb.edu/files/original/a38a2c5cae46fec655acb03ca246f449.jpg,"Physical Object","<strong>The Arts of Ancient South America</strong>",1,0
"<strong>South America, Peru, North Coast, Chimu</strong>","<em>Bottle with Handle</em>","ca. 900 - 1430 CE","<strong>South America, Peru, North Coast, Chimu</strong>","Gift of Dr. Stephen S. Goodspeed and Mrs. John Goodspeed Ainsworth",1966.63,,,,,,,,,,,,,,,,,,,,,,,,,,,,,,,,,,,,,,,,,,,,,"blackware,broken,Peruvian,Pre-Columbian,Sculpture,vessel",http://art-collections.museum.ucsb.edu/files/original/edee1c20ecaeeb731d3ac0c378d97d51.jpg,"Physical Object","<strong>The Arts of Ancient South America</strong>",1,0
"<strong>South America, Peru, North Coast, Chimu</strong>",<em>Vessel</em>,"ca. 900 - 1430","<strong>South America, Peru, North Coast, Chimu</strong>","Grace H. Dreyfus Collection",1968.52,,,,,,,,,,,,,,,,,,,,,,,,,,,,,,,,,,,,,,,,,,,,,"blackware,Figurative,Peruvian,Pre-Columbian,Sculpture,vessel",http://art-collections.museum.ucsb.edu/files/original/fda6e8f40a386d0130f69925b31d772d.jpg,"Physical Object","<strong>The Arts of Ancient South America</strong>",1,0
"<strong>South America, Peru, North Coast, Chimu</strong>","<em>Stirrup spout vessel</em>","ca. 900 - 1430 CE","<strong>South America, Peru, North Coast, Chimu</strong>","Gift of Dr. Stephen S. Goodspeed and Mrs. John Goodspeed Ainsworth",1966.12,,,,,,,,,,,,,,,,,,,,,,,,,,,,,,,,,,,,,,,,,,,,,"blackware,Peruvian,Pre-Columbian,Sculpture,stirrup-spout,vessel",http://art-collections.museum.ucsb.edu/files/original/67930d92496235eba0ad7322fb28f1ee.jpg,"Physical Object","<strong>The Arts of Ancient South America</strong>",1,0
"<strong>South America, Peru, North Coast, Chimu</strong>","<em>ceramic vessel</em>","ca. 900 - 1430 CE","<strong>South America, Peru, North Coast, Chimu</strong>","Grace H. Dreyfus Collection",1968.53,,,,,,,,,,,,,,,,,,,,,,,,,,,,,,,,,,,,,,,,,,,,,"blackware,Figurative,Peruvian,Pre-Columbian,Sculpture,vessel",http://art-collections.museum.ucsb.edu/files/original/a98f50a723864d9678c081c6b9e07a82.jpg,"Physical Object","<strong>The Arts of Ancient South America</strong>",1,0
"<strong>South America, Peru, North Coast, Chimu</strong>","<em>Coiled Stirrup Pot</em>","ca. 900 - 1430 CE","<strong>South America, Peru, North Coast, Chimu</strong>","Grace H. Dreyfus Collection",1968.56,,,,,,,,,,,,,,,,,,,,,,,,,,,,,,,,,,,,,,,,,,,,,"blackware,coiled,Peruvian,Pre-Columbian,Sculpture,stirrup-spout,vessel",http://art-collections.museum.ucsb.edu/files/original/331224478f237ffd8c4608e5dfce678b.jpg,"Physical Object","<strong>The Arts of Ancient South America</strong>",1,0
"<strong>South America, Peru, North Coast, Chimu</strong>","<em>stirrup pot</em>","ca. 900 - 1430 CE","<strong>South America, Peru, North Coast, Chimu</strong>","Grace H. Dreyfus Collection",1968.57,,,,,,,,,,,,,,,,,,,,,,,,,,,,,,,,,,,,,,,,,,,,,"blackware,Peruvian,Sculpture,stirrup-spout,vessel",http://art-collections.museum.ucsb.edu/files/original/6fbf9c899f512838812d3ab23d5f8f7b.jpg,"Physical Object","<strong>The Arts of Ancient South America</strong>",1,0
"<strong>South America, Peru, North Coast, Chimu</strong>",<em>Vessel</em>,"ca. 900 - 1430 CE","<strong>South America, Peru, North Coast, Chimu</strong>","Grace H. Dreyfus Collection",1968.59,,,,,,,,,,,,,,,,,,,,,,,,,,,,,,,,,,,,,,,,,,,,,"Peruvian,physical object,Pre-Columbian,Sculpture,vessel,weathered","http://art-collections.museum.ucsb.edu/files/original/b1076facd138d3a2bb5379d3ab30ab47.jpg,http://art-collections.museum.ucsb.edu/files/original/a8dfa9f4c08f69c97a1cd83362dd81f5.jpg","Physical Object","<strong>The Arts of Ancient South America</strong>",1,0
"<strong>South America, Peru, North Coast, Chimu</strong>",<em>Kero</em>,"ca. 900 - 1430 CE","<strong>South America, Peru, North Coast, Chimu</strong>","Grace H. Dreyfus Collection",1968.6,,,,,,,,,,,,,,,,,,,,,,,,,,,,,,,,,,,,,,,,,,,,,"blackware,Peruvian,portrait,Pre-Columbian,Sculpture,vessel",http://art-collections.museum.ucsb.edu/files/original/e81c11ab6232c9b3ff582a278cc265be.jpg,"Physical Object","<strong>The Arts of Ancient South America</strong>",1,0
"<strong>South America, Peru, North Coast, Chimu</strong>","<em>Chimu Ceramic Vessel</em>","ca. 15th C.","<strong>South America, Peru, North Coast, Chimu</strong>","Grace H. Dreyfus Collection",1968.61,,,,,,,,,,,,,,,,,,,,,,,,,,,,,,,,,,,,,,,,,,,,,"dual-handled,Peruvian,Pre-Columbian,Sculpture,utility,vessel","http://art-collections.museum.ucsb.edu/files/original/c400fb35c4070a6bf2bf3e6eb6441943.jpg,http://art-collections.museum.ucsb.edu/files/original/222610ed84f8f7af1c6aecfa0ffa6071.jpg","Physical Object","<strong>The Arts of Ancient South America</strong>",1,0
"<strong>South America, Peru, North Coast, Chimu</strong>","<em>Vessel, Huaca Sculptured Bottle</em>","ca. 900 - 1450 CE","<strong>South America, Peru, North Coast, Chimu</strong>","Grace H. Dreyfus Collection",1971.59,,,,,,,,,,,,,,,,,,,,,,,,,,,,,,,,,,,,,,,,,,,,,"animals,blackware,Peruvian,Pre-Columbian,Sculpture,vessel",http://art-collections.museum.ucsb.edu/files/original/ec731d530dfc5c90d2be2c17dd666661.jpg,"Physical Object","<strong>The Arts of Ancient South America</strong>",1,0
"<strong>South America, Peru, North Coast, Inca, Chimu</strong>",<em>Bottle</em>,"ca. 900 - 1450 AD","<strong>South America, Peru, North Coast, Inca, Chimu</strong>",,1968.68,,,,,,,,,,,,,,,,,,,,,,,,,,,,,,,,,,,,,,,,,,,,,"geometric,orange,Peruvian,Pre-Columbian,Sculpture,vessel",http://art-collections.museum.ucsb.edu/files/original/61b9fc4bf50089e02259bef72089e672.jpg,"Physical Object","<strong>The Arts of Ancient South America</strong>",1,0
"<strong>South America, North Coast, Peru, Inca, Chimu</strong>",<em>Urpu</em>,"ca. 1300-1450 CE","<strong>South America, North Coast, Peru, Inca, Chimu</strong>","Grace H. Dreyfus Collection",1968.64,,,,,,,,,,,,,,,,,,,,,,,,,,,,,,,,,,,,,,,,,,,,,"gourd,orange,Peruvian,Pre-Columbian,Sculpture,vessel",http://art-collections.museum.ucsb.edu/files/original/4f9e500c56083d79451e855cfe4426e7.jpg,"Physical Object","<strong>The Arts of Ancient South America</strong>",1,0
"<strong>South America, North Coast, Peru, Inca, Chimu</strong>",<em>vessel</em>,"ca. 15th - 16th C., Late Horizon Period","<strong>South America, North Coast, Peru, Inca, Chimu</strong>","Grace H. Dreyfus Collection",1968.54,,,,,,,,,,,,,,,,,,,,,,,,,,,,,,,,,,,,,,,,,,,,,"blackware,geometric,Peruvian,Pre-Columbian,Sculpture,vessel",http://art-collections.museum.ucsb.edu/files/original/81b10740d7a9e9e024a358a049e99ab0.jpg,"Physical Object","<strong>The Arts of Ancient South America</strong>",1,0
"<strong>South America, Peru, Central Coast, Inca</strong>",<em>Bowl</em>,"ca. 1000 -1476 CE","<strong>South America, Peru, Central Coast, Inca</strong>",,1968.67,,,,,,,,,,,,,,,,,,,,,,,,,,,,,,,,,,,,,,,,,,,,,"geometric,orange,Peruvian,Pre-Columbian,Sculpture,vessel",http://art-collections.museum.ucsb.edu/files/original/5e15c23d57c57ace1667cb8082290e86.jpg,"Physical Object","<strong>The Arts of Ancient South America</strong>",1,0
"<strong>South America, Peru, North Coast, Moche</strong>","<em>stirruup spout vessel</em>",n.d.,"<strong>South America, Peru, North Coast, Moche</strong>","Gift of Dr. Stephen S. Goodspeed and Mrs. John Goodspeed Ainsworth",1966.14,,,,,,,,,,,,,,,,,,,,,,,,,,,,,,,,,,,,,,,,,,,,,"Peruvian,polychrome,Pre-Columbian,red,Sculpture,stirrup-spout,vessel",http://art-collections.museum.ucsb.edu/files/original/65c55a21fec8c04c036ce3e766277826.jpg,"Physical Object","<strong>The Arts of Ancient South America</strong>",1,0
"<strong>South America, Peru, North Coast, Moche</strong>","<em>Stirrup spout effigy vessel</em>",n.d.,"<strong>South America, Peru, North Coast, Moche</strong>","Gift of Dr. Stephen S. Goodspeed and Mrs. John Goodspeed Ainsworth",1966.16,,,,,,,,,,,,,,,,,,,,,,,,,,,,,,,,,,,,,,,,,,,,,"corn,Figurative,Peruvian,Pre-Columbian,Sculpture,vessel",http://art-collections.museum.ucsb.edu/files/original/8d25beae63ee29d17f550a436d921881.jpg,"Physical Object","<strong>The Arts of Ancient South America</strong>",1,0
"<strong>South America, Peru, South Coast, Nazca</strong>","<em>Modeled double spot Lucuma</em>","1-450 C.E.","<strong>South America, Peru, South Coast, Nazca</strong>","Gift of Dr. Stephen S. Goodspeed and Mrs. John Goodspeed Ainsworth",1966.23,,,,,,,,,,,,,,,,,,,,,,,,,,,,,,,,,,,,,,,,,,,,,"Peruvian,polychrome,Pre-Columbian,red,Sculpture,vessel",http://art-collections.museum.ucsb.edu/files/original/de1e3b398653ee5757428985bd921a81.jpg,"Physical Object","<strong>The Arts of Ancient South America</strong>",1,0
"<strong>South America, Peru, South Coast, Nazca</strong>","<em>Double spout and bridge vessel</em>","200 BCE- CE 600","<strong>South America, Peru, South Coast, Nazca</strong>","Gift of Antoinette Amorteguy",1994.3,,,,,,,,,,,,,,,,,,,,,,,,,,,,,,,,,,,,,,,,,,,,,"Mythology,Peruvian,polychrome,Pre-Columbian,Sculpture,vessel",http://art-collections.museum.ucsb.edu/files/original/01ef5e33bb7f03f4af2e46dfd5434e0a.jpg,"Physical Object","<strong>The Arts of Ancient South America</strong>",1,0
"<strong>South America, Peru, South Coast, Nazca</strong>","<em>Cup Bowl`</em>","1-450 C.E.","<strong>South America, Peru, South Coast, Nazca</strong>","Gift of Dr. Stephen S. Goodspeed and Mrs. John Goodspeed Ainsworth",1966.20,,,,,,,,,,,,,,,,,,,,,,,,,,,,,,,,,,,,,,,,,,,,,"abstract,Peruvian,polychrome,Pre-Columbian,Sculpture,vessel",http://art-collections.museum.ucsb.edu/files/original/49a52d5012c9342b016db86a6df51d38.jpg,"Physical Object","<strong>The Arts of Ancient South America</strong>",1,0
"<strong>South America, Peru, South Coast, Nazca</strong>",<em>Bowl</em>,"1-450 C.E.","<strong>South America, Peru, South Coast, Nazca</strong>","Gift of Dr. Stephen S. Goodspeed and Mrs. John Goodspeed Ainsworth",1966.30,,,,,,,,,,,,,,,,,,,,,,,,,,,,,,,,,,,,,,,,,,,,,"peppers,Peruvian,polychrome,Pre-Columbian,Sculpture,vessel",http://art-collections.museum.ucsb.edu/files/original/7090e9abd63dd9940ccfeb99fcb01997.jpg,"Physical Object","<strong>The Arts of Ancient South America</strong>",1,0