﻿"Dublin Core:Title","Dublin Core:Description","Dublin Core:Date","Dublin Core:Creator","Dublin Core:Source","Dublin Core:Identifier","Dublin Core:Contributor","Dublin Core:Rights","Dublin Core:Relation","Dublin Core:Format","Dublin Core:Language","Dublin Core:Type","Dublin Core:Coverage","Dublin Core:Subject","Dublin Core:Publisher","Item Type Metadata:Birth Date","Item Type Metadata:Birthplace","Item Type Metadata:Event Type","Item Type Metadata:Participants","Item Type Metadata:URL","Item Type Metadata:Death Date","Item Type Metadata:Occupation","Item Type Metadata:Biographical Text","Item Type Metadata:Bibliography","Item Type Metadata:File name","Item Type Metadata:Time Summary","Item Type Metadata:Interviewer","Item Type Metadata:Interviewee","Item Type Metadata:Location","Item Type Metadata:Transcription","Item Type Metadata:Local URL","Item Type Metadata:Original Format","Item Type Metadata:Physical Dimensions","Item Type Metadata:Duration","Item Type Metadata:Compression","Item Type Metadata:Producer","Item Type Metadata:Director","Item Type Metadata:Bit Rate/Frequency","Item Type Metadata:Text","Item Type Metadata:Email Body","Item Type Metadata:Subject Line","Item Type Metadata:From","Item Type Metadata:To","Item Type Metadata:CC","Item Type Metadata:BCC","Item Type Metadata:Number of Attachments","Item Type Metadata:Standards","Item Type Metadata:Objectives","Item Type Metadata:Materials","Item Type Metadata:Tags",tags,file,itemType,collection,public,featured
"<strong>Artist unknown</strong>","<em>G75 Nagasaki Harbour</em>","20th C.","<strong>Artist unknown</strong>","Gift of Mr. Keith Gledhill",1986.95,,,,,,,,,,,,,,,,,,,,,,,,,,,,,,,,,,,,,,,,,,,,,"Albumen with Hand Coloring,Boat,G75 Nagasaki Harbour,Harbour,Hillside,landscape,Shrubbery,water,Works-on-Paper",http://art-collections.museum.ucsb.edu/files/original/ed9d42fd20dd12feed3c8729478a14f1.jpg,"Physical Object","<strong>The Carolyn and Edwin Gledhill Photography Collection</strong>",1,0
"<strong>Artist unknown</strong>","<em>Crater with Receeding Water</em>",1898,"<strong>Artist unknown</strong>","Gift of Mr. Keith Gledhill",1986.122,,,,,,,,,,,,,,,,,,,,,,,,,,,,,,,,,,,,,,,,,,,,,"black and white,Crater,landscape,Mountain,Outdoor,photograph,water",http://art-collections.museum.ucsb.edu/files/original/e90c018f419f2bfc47a3b97c37cd6cba.jpg,"Physical Object","<strong>The Carolyn and Edwin Gledhill Photography Collection</strong>",1,0
"<strong>Artist unknown</strong>","<em>Landscape/Derwent Water</em>",n.d.,"<strong>Artist unknown</strong>","Gift of Mr. Keith Gledhill",1986.168,,,,,,,,,,,,,,,,,,,,,,,,,,,,,,,,,,,,,,,,,,,,,"Albumen Print,Boat,buggy,Canoe,landscape,Mountain,photograph,Wagon,water",http://art-collections.museum.ucsb.edu/files/original/19ba965fcfa25cbbc101cd0290e95ead.jpg,"Physical Object","<strong>The Carolyn and Edwin Gledhill Photography Collection</strong>",1,0
"<strong>Artist unknown</strong>","<em>Relief of 2 figures, water, boat and volcano</em>",n.d.,"<strong>Artist unknown</strong>",,1973.243,,,,,,,,,,,,,,,,,,,,,,,,,,,,,,,,,,,,,,,,,,,,,"Boat,brown,Figurative,patina,plaster,Sculpture,volcano,water",,"Physical Object","<strong>Sculpture and Mixed Media</strong>",1,0
"<strong>GLEDHILL</strong>, Carolyn and Edwin","<em>Theatrical Scene (three figures), 1921</em>","20th C.","<strong>GLEDHILL</strong>, Carolyn and Edwin","Gift of Mr. Keith Gledhill",1986.69,,,,,,,,,,,,,,,,,,,,,,,,,,,,,,,,,,,,,,,,,,,,,"Candles,Costumes,Dress-Up,photograph,portrait,Theatrical Scene,water,Willow Tree",http://art-collections.museum.ucsb.edu/files/original/b0c4f11a13428d5de592e1a33fef5961.jpg,"Physical Object","<strong>The Carolyn and Edwin Gledhill Photography Collection</strong>",1,0
"<strong>GLEDHILL</strong>, Carolyn and Edwin","<em>Pan-Pacific Exhibition #3</em>",1915,"<strong>GLEDHILL</strong>, Carolyn and Edwin","Gift of Mr. Keith Gledhill",1986.78,,,,,,,,,,,,,,,,,,,,,,,,,,,,,,,,,,,,,,,,,,,,,"architecture,Marble,Pan-Pacific Exhibition,photograph,Pillars,Pots,Reflection,water",http://art-collections.museum.ucsb.edu/files/original/8898faaf99621a17ecfe963c82655a2f.jpg,"Physical Object","<strong>The Carolyn and Edwin Gledhill Photography Collection</strong>",1,0
"<strong>GLEDHILL</strong>, Carolyn and Edwin","<em>Tugboat and Bridge (N.Y.C.)</em>",1938,"<strong>GLEDHILL</strong>, Carolyn and Edwin","Gift of Mr. Keith Gledhill",1986.84,,,,,,,,,,,,,,,,,,,,,,,,,,,,,,,,,,,,,,,,,,,,,"bridge,Foggy,Harbour,landscape,Tugboat,water,Wharf",http://art-collections.museum.ucsb.edu/files/original/e4eb61a8951f487368e37ac4f6d23bcd.jpg,"Physical Object","<strong>The Carolyn and Edwin Gledhill Photography Collection</strong>",1,0
"<strong>JORGENSEN</strong>, Susan","Seashells, n.d.",n.d.,"<strong>JORGENSEN</strong>, Susan","Estate of Frances Garvin and Keith Julius Puccinelli",2018.001.057,,,,,,,,,,,,,,,,,,,,,,,,,,,,,,,,,,,,,,,,,,,,,"landscape,ocean,photograph,Sand,water",http://art-collections.museum.ucsb.edu/files/original/24269e16058fb80c08eaf55874d83b2f.jpg,,"<strong>The Keith Puccinelli Collection of Art and Design</strong>",1,0
"<strong>LEWIS</strong>, Martin","<em>Ice Cream Cones</em>",1928,"<strong>LEWIS,</strong> Martin","Gift of Don Trevey to the Ken Trevey Collection of American Realist Prints",1992.121,,,,,,,,,,,,,,,,,,,,,,,,,,,,,,,,,,,,,,,,,,,,,"beach,children,drypoint,seascape,water,Works-on-Paper",http://art-collections.museum.ucsb.edu/files/original/2ec2c2a84fb83d616a397f274f194dee.jpg,"Physical Object","<strong>The Ken Trevey Collection of American Realist Prints</strong>",1,0
"<strong>LUNGREN</strong>, Fernand","<em>Silent Sea</em>","ca. 1926-30","<strong>LUNGREN</strong>, Fernand","Fernand Lungren Bequest",1964.713,,,,,,,,,,,,,,,,,,,,,,,,,,,,,,,,,,,,,,,,,,,,,"19th century,20th century,canvas,oil,Painting,seascape,water",http://art-collections.museum.ucsb.edu/files/original/27e0e9a4fab4549234a9e52c671b26e5.jpg,"Physical Object","<strong>The Fernand Lungren Bequest</strong>",1,0
"<strong>LUNGREN</strong>, Fernand","<em>Bank of the Nile</em>, from the Egyptian Series",1901,"<strong>LUNGREN</strong>, Fernand","Fernand Lungren Bequest",1964.924,,,,,,,,,,,,,,,,,,,,,,,,,,,,,,,,,,,,,,,,,,,,,"Drawing,egypt,landscape,paper,Pencil,river,Riverbank,water",http://art-collections.museum.ucsb.edu/files/original/663e2c1a2cd595f071749c6cb41b2c1c.jpg,"Physical Object","<strong>The Fernand Lungren Bequest</strong>",1,0
"<strong>LUNGREN</strong>, Fernand","<em>Dipping Water</em>, from the Egyptian Series","19th-20th C","<strong>LUNGREN</strong>, Fernand","Fernand Lungren Bequest",1964.937,,,,,,,,,,,,,,,,,,,,,,,,,,,,,,,,,,,,,,,,,,,,,"Drawing,Graphite,paper,river,still-life,water,woman",http://art-collections.museum.ucsb.edu/files/original/d714d66d4a2e0e7a81567f27a5994981.jpg,"Physical Object","<strong>The Fernand Lungren Bequest</strong>",1,0
"<strong>Maker unknown, Great Basin, Paiute</strong>","<em>Water basket</em>","20th C.","Maker unknown, Great Basin, Paiute","F. May Young Collection, given by Luella D. Saxby",1965.49,,,,,,,,,,,,,,,,,,,,,,,,,,,,,,,,,,,,,,,,,,,,,"Basket,still life,Textile,water,Woven",http://art-collections.museum.ucsb.edu/files/original/c4611ab3ecd2e9f48ae4760e96e04055.jpg,"Physical Object","<p><strong>The Arts of Indigenous North America</strong></p>",1,0
"<strong>Maker unknown, Great Basin, Paiute</strong>","<em>Water Bottle Basket</em>","20th C.","<strong>Maker unknown, Great Basin, Paiute</strong>","F. May Young Collection, given by Luella D. Saxby",1965.50,,,,,,,,,,,,,,,,,,,,,,,,,,,,,,,,,,,,,,,,,,,,,"Basket,bottle,Sculpture,still life,Textile,water,Woven",http://art-collections.museum.ucsb.edu/files/original/b67f33d02467aa055e2eb1db92c6ce6b.jpg,"Physical Object","<p><strong>The Arts of Indigenous North America</strong></p>",1,0
"<strong>MELLER</strong>, Peter",<em>Narcissus</em>,"ca. 1970-80s","Meller, Peter","Incoming loan, courtesy John Moore",IL2014.001.017,,,,,,,,,,,,,,,,,,,,,,,,,,,,,,,,,,,,,,,,,,,,,"Figure,Ink,landscape,print,water,Works-on-Paper",http://art-collections.museum.ucsb.edu/files/original/229fe99622485a0b1977cb604189214a.jpg,"Physical Object","<strong>UCSB Alumni and Faculty</strong>",1,0
"<strong>MELLER</strong>, Peter",<em>Narcissus</em>,"ca. 1970-80s","Meller, Peter","Incoming loan, courtesy John Moore",IL2014.001.018,,,,,,,,,,,,,,,,,,,,,,,,,,,,,,,,,,,,,,,,,,,,,"Figure,landscape,print,water,Works-on-Paper",http://art-collections.museum.ucsb.edu/files/original/e956e62cf7f2f99a7add46844f94e480.jpg,"Physical Object","<strong>UCSB Alumni and Faculty</strong>",1,0
"<strong>METHEANY</strong>, John","<em>Limits of Structure, Part 3</em>",1965,"<strong>METHEANY</strong>, John","American Academy of Arts and Letters, Childe Hassam Fund",1968.11,,,,,,,,,,,,,,,,,,,,,,,,,,,,,,,,,,,,,,,,,,,,,"landscape,oil,Painting,stream,tree trunks,trees,water",http://art-collections.museum.ucsb.edu/files/original/d5bb827de2a3e42a3f56285fb414ee5c.jpg,"Physical Object",<strong>Paintings</strong>,1,0
"<strong>VILLALONGO</strong>, William","<em>TRANCE/BORDERS: Funky Space Reincarnation</em>",2006,"<strong>VILLALONGO</strong>, William","Gift of Exit Art, New York",2012.009.004.007,,,,,,,,,,,,,,,,,,,,,,,,,,,,,,,,,,,,,,,,,,,,,"abstract,Abstract Face,Cartoon,colorful,Eyes,forest,mixed-media,Nature,Pine Tree,Pond,Portal,water,Woods,Works-on-Paper",http://art-collections.museum.ucsb.edu/files/original/54cfa1f4dde2d121d9c02285d5d905ed.jpg,"Physical Object","<strong>EXIT ART</strong>",1,0
